{"text_format":"1","workbook":"xlsx","n_sheets":6,"sheets":["Corona-Covid 19 Data","Country Chart","sozialministerium.at","ourworldindata.org_Coronavirus","Population Statistics","Full Country Name"],"not_rendered":{"charts":1,"images":1,"macros":1,"external_links":0,"defined_names":2,"comments":0,"pivot_tables":0},"unopened":[],"bounds":{"document_bytes":16777216,"sheet_cells":100000,"rows_first":2000,"rows_last":500,"rows_between":2000,"halvings":0,"cell_chars":16384,"cell_head_chars":4096},"cells_cut":0,"cells_raw":0,"read":"whole","date_system":"1900"}

{"sheet":"Corona-Covid 19 Data","index":0,"n_rows":1002,"n_cols":176,"rows_kept":1002,"cut":false,"hidden":false,"merged":[]}
[null,"Province/State","Country/Region","Lat","Long","1/22/20","1/23/20","1/24/20","1/25/20","1/26/20","1/27/20","1/28/20","1/29/20","1/30/20","1/31/20","2020-01-02","2020-02-02","2020-03-02","2020-04-02","2020-05-02","2020-06-02","2020-07-02","2020-08-02","2020-09-02","2020-10-02","2020-11-02","2020-12-02","2/13/20","2/14/20","2/15/20","2/16/20","2/17/20","2/18/20","2/19/20","2/20/20","2/21/20","2/22/20","2/23/20","2/24/20","2/25/20","2/26/20","2/27/20","2/28/20","2/29/20","2020-01-03","2020-02-03","2020-03-03","2020-04-03","2020-05-03","2020-06-03","2020-07-03","2020-08-03","2020-09-03","2020-10-03","2020-11-03","2020-12-03","3/13/20","3/14/20","3/15/20","3/16/20","3/17/20","3/18/20","3/19/20","3/20/20","3/21/20","3/22/20","3/23/20","3/24/20","3/25/20","3/26/20","3/27/20","3/28/20","3/29/20","3/30/20","3/31/20","2020-01-04","2020-02-04","2020-03-04","2020-04-04","2020-05-04","2020-06-04","2020-07-04","2020-08-04","2020-09-04","2020-10-04","2020-11-04","2020-12-04","4/13/20","4/14/20","4/15/20","4/16/20","4/17/20","4/18/20","4/19/20","4/20/20","4/21/20","4/22/20","4/23/20","4/24/20","4/25/20","4/26/20","4/27/20","4/28/20","4/29/20","4/30/20","2020-01-05","2020-02-05","2020-03-05","2020-04-05","2020-05-05","2020-06-05","2020-07-05","2020-08-05","2020-09-05","2020-10-05","2020-11-05","2020-12-05","5/13/20","5/14/20","5/15/20","5/16/20","5/17/20","5/18/20","5/19/20","5/20/20","5/21/20","5/22/20","5/23/20","5/24/20","5/25/20","5/26/20","5/27/20","5/28/20","5/29/20","5/30/20","5/31/20","2020-01-06","2020-02-06","2020-03-06","2020-04-06","2020-05-06","2020-06-06","2020-07-06","2020-08-06","2020-09-06","2020-10-06","2020-11-06","2020-12-06","6/13/20","6/14/20","6/15/20","6/16/20","6/17/20","6/18/20","6/19/20","6/20/20","6/21/20","6/22/20","6/23/20","6/24/20","6/25/20","6/26/20","6/27/20","6/28/20","6/29/20","6/30/20","2020-01-07","2020-02-07","2020-03-07","2020-04-07","2020-05-07","2020-06-07","2020-07-07","2020-08-07","2020-09-07","2020-10-07"]
[null,null,"Afghanistan","33.0","65.0",0,0,0,0,0,0,0,0,0,0,0,0,0,0,0,0,0,0,0,0,0,0,0,0,0,0,0,0,0,0,0,0,0,1,1,1,1,1,1,1,1,1,1,1,1,1,4,4,5,7,7,7,11,16,21,22,22,22,24,24,40,40,74,84,94,110,110,120,170,174,237,273,281,299,349,367,423,444,484,521,555,607,665,714,784,840,906,933,996,1026,1092,1176,1279,1351,1463,1531,1703,1828,1939,2171,2335,2469,2704,2894,3224,3392,3563,3778,4033,4402,4687,4963,5226,5639,6053,6402,6664,7072,7653,8145,8676,9216,9998,10582,11173,11831,12456,13036,13659,14525,15205,15750,16509,17267,18054,18969,19551,20342,20917,21459,22142,22890,23546,24102,24766,25527,26310,26874,27532,27878,28424,28833,29157,29481,29640,30175,30451,30616,30967,31238,31517,31836,32022,32324,32672,32951,33190,33384,33594,33908,34194]
[null,null,"Albania",411533,201683,0,0,0,0,0,0,0,0,0,0,0,0,0,0,0,0,0,0,0,0,0,0,0,0,0,0,0,0,0,0,0,0,0,0,0,0,0,0,0,0,0,0,0,0,0,0,0,2,10,12,23,33,38,42,51,55,59,64,70,76,89,104,123,146,174,186,197,212,223,243,259,277,304,333,361,377,383,400,409,416,433,446,467,475,494,518,539,548,562,584,609,634,663,678,712,726,736,750,766,773,782,789,795,803,820,832,842,850,856,868,872,876,880,898,916,933,946,948,949,964,969,981,989,998,1004,1029,1050,1076,1099,1122,1137,1143,1164,1184,1197,1212,1232,1246,1263,1299,1341,1385,1416,1464,1521,1590,1672,1722,1788,1838,1891,1962,1995,2047,2114,2192,2269,2330,2402,2466,2535,2580,2662,2752,2819,2893,2964,3038,3106,3188,3278]
[null,null,"Algeria",280339,16596,0,0,0,0,0,0,0,0,0,0,0,0,0,0,0,0,0,0,0,0,0,0,0,0,0,0,0,0,0,0,0,0,0,0,1,1,1,1,1,1,3,5,12,12,17,17,19,20,20,20,24,26,37,48,54,60,74,87,90,139,201,230,264,302,367,409,454,511,584,716,847,986,1171,1251,1320,1423,1468,1572,1666,1761,1825,1914,1983,2070,2160,2268,2418,2534,2629,2718,2811,2910,3007,3127,3256,3382,3517,3649,3848,4006,4154,4295,4474,4648,4838,4997,5182,5369,5558,5723,5891,6067,6253,6442,6629,6821,7019,7201,7377,7542,7728,7918,8113,8306,8503,8697,8857,8997,9134,9267,9394,9513,9626,9733,9831,9935,10050,10154,10265,10382,10484,10589,10698,10810,10919,11031,11147,11268,11385,11504,11631,11771,11920,12076,12248,12445,12685,12968,13273,13571,13907,14272,14657,15070,15500,15941,16404,16879,17348,17808,18242]
[null,null,"Andorra",425063,15218,0,0,0,0,0,0,0,0,0,0,0,0,0,0,0,0,0,0,0,0,0,0,0,0,0,0,0,0,0,0,0,0,0,0,0,0,0,0,0,0,1,1,1,1,1,1,1,1,1,1,1,1,1,1,2,39,39,53,75,88,113,133,164,188,224,267,308,334,370,376,390,428,439,466,501,525,545,564,583,601,601,638,646,659,673,673,696,704,713,717,717,723,723,731,738,738,743,743,743,745,745,747,748,750,751,751,752,752,754,755,755,758,760,761,761,761,761,761,761,762,762,762,762,762,763,763,763,763,764,764,764,765,844,851,852,852,852,852,852,852,852,852,853,853,853,853,854,854,855,855,855,855,855,855,855,855,855,855,855,855,855,855,855,855,855,855,855,855,855,855,855]
[null,null,"Angola",-112027,178739,0,0,0,0,0,0,0,0,0,0,0,0,0,0,0,0,0,0,0,0,0,0,0,0,0,0,0,0,0,0,0,0,0,0,0,0,0,0,0,0,0,0,0,0,0,0,0,0,0,0,0,0,0,0,0,0,0,0,1,2,2,3,3,3,4,4,5,7,7,7,8,8,8,10,14,16,17,19,19,19,19,19,19,19,19,19,19,24,24,24,24,25,25,25,25,26,27,27,27,27,30,35,35,35,36,36,36,43,43,45,45,45,45,48,48,48,48,50,52,52,58,60,61,69,70,70,71,74,81,84,86,86,86,86,86,86,88,91,92,96,113,118,130,138,140,142,148,155,166,172,176,183,186,189,197,212,212,259,267,276,284,291,315,328,346,346,346,386,386,396,458]
[null,null,"Antigua and Barbuda",170608,-617964,0,0,0,0,0,0,0,0,0,0,0,0,0,0,0,0,0,0,0,0,0,0,0,0,0,0,0,0,0,0,0,0,0,0,0,0,0,0,0,0,0,0,0,0,0,0,0,0,0,0,0,1,1,1,1,1,1,1,1,1,1,3,3,3,7,7,7,7,7,7,7,9,15,15,15,15,19,19,19,19,21,21,23,23,23,23,23,23,23,23,23,24,24,24,24,24,24,24,24,24,25,25,25,25,25,25,25,25,25,25,25,25,25,25,25,25,25,25,25,25,25,25,25,25,25,25,25,25,25,25,26,26,26,26,26,26,26,26,26,26,26,26,26,26,26,26,26,26,26,26,26,26,26,26,26,65,65,65,69,69,69,69,69,68,68,68,70,70,70,73,74]
[null,null,"Argentina",-384161,-636167,0,0,0,0,0,0,0,0,0,0,0,0,0,0,0,0,0,0,0,0,0,0,0,0,0,0,0,0,0,0,0,0,0,0,0,0,0,0,0,0,0,1,1,1,2,8,12,12,17,19,19,31,34,45,56,68,79,97,128,158,266,301,387,387,502,589,690,745,820,1054,1054,1133,1265,1451,1451,1554,1628,1715,1795,1975,1975,2142,2208,2277,2443,2571,2669,2758,2839,2941,3031,3144,3435,3607,3780,3892,4003,4127,4285,4428,4532,4681,4783,4887,5020,5208,5371,5611,5776,6034,6278,6563,6879,7134,7479,7805,8068,8371,8809,9283,9931,10649,11353,12076,12628,13228,13933,14702,15419,16214,16851,17415,18319,19268,20197,21037,22020,22794,23620,24761,25987,27373,28764,30295,31577,32785,34159,35552,37510,39570,41204,42785,44931,47203,49851,52457,55343,57744,59933,62268,64530,67197,69941,72786,75376,77815,80447,83426,87030,90693,94060]
[null,null,"Armenia",400691,450382,0,0,0,0,0,0,0,0,0,0,0,0,0,0,0,0,0,0,0,0,0,0,0,0,0,0,0,0,0,0,0,0,0,0,0,0,0,0,0,1,1,1,1,1,1,1,1,1,1,1,4,8,18,26,52,78,84,115,136,160,194,235,249,265,290,329,407,424,482,532,571,663,736,770,822,833,853,881,921,937,967,1013,1039,1067,1111,1159,1201,1248,1291,1339,1401,1473,1523,1596,1677,1746,1808,1867,1932,2066,2148,2273,2386,2507,2619,2782,2884,3029,3175,3313,3392,3538,3718,3860,4044,4283,4472,4823,5041,5271,5606,5928,6302,6661,7113,7402,7774,8216,8676,8927,9282,9492,10009,10524,11221,11817,12364,13130,13325,13675,14103,14669,15281,16004,16667,17064,17489,18033,18698,19157,19708,20268,20588,21006,21717,22488,23247,23909,24645,25127,25542,26065,26658,27320,27900,28606,28936,29285,29820,30346,30903]
[null,"Australian Capital Territory","Australia",-354735,1490124,0,0,0,0,0,0,0,0,0,0,0,0,0,0,0,0,0,0,0,0,0,0,0,0,0,0,0,0,0,0,0,0,0,0,0,0,0,0,0,0,0,0,0,0,0,0,0,0,0,0,0,1,1,1,2,2,3,4,6,9,19,32,39,39,53,62,71,77,78,80,84,87,91,93,96,96,96,99,100,103,103,103,102,103,103,103,103,103,103,104,104,104,104,105,106,106,106,106,106,106,106,106,106,107,107,107,107,107,107,107,107,107,107,107,107,107,107,107,107,107,107,107,107,107,107,107,107,107,107,107,107,107,107,107,107,107,108,108,108,108,108,108,108,108,108,108,108,108,108,108,108,108,108,108,108,108,108,108,108,108,108,108,108,108,108,108,108,111,112,113,113]
[null,"New South Wales","Australia",-338688,1512093,0,0,0,0,3,4,4,4,4,4,4,4,4,4,4,4,4,4,4,4,4,4,4,4,4,4,4,4,4,4,4,4,4,4,4,4,4,4,4,6,6,13,22,22,26,28,38,48,55,65,65,92,112,134,171,210,267,307,353,436,669,669,818,1029,1219,1405,1617,1791,2032,2032,2182,2298,2389,2493,2580,2637,2686,2734,2773,2822,2857,2857,2863,2870,2886,2897,2926,2936,2957,2963,2969,2971,2976,2982,2994,3002,3004,3016,3016,3025,3030,3035,3033,3035,3042,3044,3047,3051,3053,3053,3053,3059,3063,3071,3074,3075,3076,3078,3081,3082,3084,3086,3087,3090,3092,3089,3090,3092,3092,3095,3098,3104,3104,3106,3110,3110,3109,3112,3114,3117,3117,3115,3119,3128,3131,3134,3135,3137,3143,3144,3149,3151,3150,3159,3162,3168,3174,3177,3184,3189,3203,3211,3211,3405,3419,3429,3433,3440,3453,3467,3474]
[null,"Northern Territory","Australia",-124634,1308456,0,0,0,0,0,0,0,0,0,0,0,0,0,0,0,0,0,0,0,0,0,0,0,0,0,0,0,0,0,0,0,0,0,0,0,0,0,0,0,0,0,0,1,1,0,0,0,0,1,1,1,1,1,1,1,1,1,1,3,3,5,5,6,6,12,12,15,15,15,17,19,21,22,26,27,28,28,28,28,28,28,28,28,28,28,28,28,28,28,28,28,28,28,28,28,28,28,28,28,28,27,29,29,29,29,29,29,29,29,29,29,29,29,29,29,29,29,29,29,29,29,29,29,29,29,29,29,29,29,29,29,29,29,29,29,29,29,29,29,29,29,29,29,29,29,29,29,29,29,29,29,29,29,29,29,29,29,29,29,29,29,30,30,30,30,30,30,30,30,31,31]
[null,"Queensland","Australia",-280167,"153.4",0,0,0,0,0,0,0,1,3,2,3,2,2,3,3,4,5,5,5,5,5,5,5,5,5,5,5,5,5,5,5,5,5,5,5,5,5,5,9,9,9,11,11,13,13,13,15,15,18,20,20,35,46,61,68,78,94,144,184,221,259,319,397,443,493,555,625,656,689,743,781,835,873,900,907,921,934,943,953,965,974,983,987,998,999,1001,1007,1015,1019,1019,1024,1024,1026,1026,1026,1030,1033,1034,1033,1033,1034,1035,1038,1043,1043,1045,1045,1045,1045,1045,1051,1052,1051,1054,1055,1055,1057,1057,1058,1058,1058,1060,1061,1056,1057,1058,1058,1058,1058,1058,1058,1059,1059,1060,1060,1061,1061,1062,1062,1062,1063,1064,1065,1065,1065,1065,1066,1066,1066,1066,1066,1066,1066,1066,1066,1067,1067,1067,1067,1067,1067,1067,1067,1067,1067,1067,1068,1068,1068,1068,1070]
[null,"South Australia","Australia",-349285,1386007,0,0,0,0,0,0,0,0,0,0,1,2,2,2,2,2,2,2,2,2,2,2,2,2,2,2,2,2,2,2,2,2,2,2,2,2,2,2,3,3,3,3,5,5,7,7,7,7,7,9,9,16,19,20,29,29,37,42,50,67,100,134,170,170,235,257,287,299,305,337,367,367,396,407,407,411,411,415,420,428,429,429,429,433,433,433,435,435,435,435,437,438,438,438,438,438,438,438,438,438,438,438,438,438,438,438,439,439,439,439,439,439,439,439,439,439,439,439,439,439,439,439,439,439,439,440,440,440,440,440,440,440,440,440,440,440,440,440,440,440,440,440,440,440,440,440,440,440,440,440,440,440,440,440,440,440,440,440,440,443,443,443,443,443,443,443,443,443,443,443,443]
[null,"Tasmania","Australia",-414545,1459707,0,0,0,0,0,0,0,0,0,0,0,0,0,0,0,0,0,0,0,0,0,0,0,0,0,0,0,0,0,0,0,0,0,0,0,0,0,0,0,0,1,1,1,1,1,1,2,2,2,3,3,5,5,6,7,7,10,10,10,16,22,28,28,36,47,47,62,66,66,69,69,72,74,80,82,86,89,98,111,122,133,133,144,165,165,169,180,188,195,200,201,205,207,207,207,212,214,218,219,221,221,221,221,221,225,226,227,227,227,227,227,227,227,227,228,228,228,228,228,228,228,228,228,228,228,228,228,228,228,228,228,228,228,228,228,228,228,228,228,228,228,228,228,228,228,228,228,228,228,228,228,228,228,228,228,228,228,228,228,228,228,228,228,228,228,228,228,228,228,228,228]
[null,"Victoria","Australia",-378136,1449631,0,0,0,0,1,1,1,1,2,3,4,4,4,4,4,4,4,4,4,4,4,4,4,4,4,4,4,4,4,4,4,4,4,4,4,4,4,4,7,7,9,9,10,10,10,11,11,15,18,21,21,36,49,57,71,94,121,121,121,229,355,355,411,466,520,574,685,769,821,917,968,1036,1085,1115,1135,1158,1191,1212,1228,1241,1265,1268,1281,1291,1299,1299,1302,1319,1328,1329,1336,1336,1337,1343,1346,1349,1349,1354,1361,1364,1371,1384,1406,1423,1440,1454,1467,1468,1487,1496,1511,1514,1521,1540,1551,1558,1564,1573,1573,1581,1593,1593,1603,1605,1610,1618,1628,1634,1645,1649,1653,1663,1670,1678,1681,1681,1685,1687,1687,1691,1699,1703,1703,1720,1732,1741,1762,1780,1792,1792,1836,1847,1864,1884,1917,1947,1947,2028,2099,2159,2231,2303,2368,2368,2536,2660,2824,2942,3098,3397,3560]
[null,"Western Australia","Australia",-319505,1158605,0,0,0,0,0,0,0,0,0,0,0,0,0,0,0,0,0,0,0,0,0,0,0,0,0,0,0,0,0,0,0,0,0,0,0,0,0,0,2,2,2,2,2,3,3,3,3,4,6,9,9,14,17,17,28,31,35,52,64,90,120,140,175,175,231,231,278,311,355,364,392,400,400,436,453,460,460,481,495,506,514,514,517,527,527,532,541,544,545,545,546,546,546,548,549,549,549,550,551,551,551,551,551,551,551,551,552,552,552,552,553,553,552,552,552,553,554,557,557,557,557,557,560,560,564,570,570,577,585,586,589,591,592,592,592,596,599,599,599,599,601,602,602,602,602,602,602,603,603,604,605,605,607,607,608,608,608,609,609,611,611,611,611,611,612,618,621,624,624,627,634]
[null,null,"Austria",475162,145501,0,0,0,0,0,0,0,0,0,0,0,0,0,0,0,0,0,0,0,0,0,0,0,0,0,0,0,0,0,0,0,0,0,0,2,2,3,3,9,14,18,21,29,41,55,79,104,131,182,246,302,504,655,860,1018,1332,1646,2013,2388,2814,3582,4474,5283,5588,6909,7657,8271,8788,9618,10180,10711,11129,11524,11781,12051,12297,12639,12942,13244,13555,13806,13945,14041,14226,14336,14476,14595,14671,14749,14795,14873,14925,15002,15071,15148,15225,15274,15357,15402,15452,15531,15558,15597,15621,15650,15684,15752,15774,15833,15871,15882,15961,15997,16058,16109,16201,16242,16269,16321,16353,16404,16436,16486,16503,16539,16557,16591,16628,16655,16685,16731,16733,16759,16771,16805,16843,16898,16902,16968,16979,17005,17034,17064,17078,17109,17135,17189,17203,17223,17271,17323,17341,17380,17408,17449,17477,17522,17580,17654,17723,17766,17873,17941,18050,18165,18280,18365,18421,18513,18615,18709]
[null,null,"Azerbaijan",401431,475769,0,0,0,0,0,0,0,0,0,0,0,0,0,0,0,0,0,0,0,0,0,0,0,0,0,0,0,0,0,0,0,0,0,0,0,0,0,0,0,3,3,3,3,6,6,9,9,9,11,11,11,15,15,23,28,28,28,44,44,53,65,72,87,93,122,165,182,209,273,298,359,400,443,521,584,641,717,822,926,991,1058,1098,1148,1197,1253,1283,1340,1373,1398,1436,1480,1518,1548,1592,1617,1645,1678,1717,1766,1804,1854,1894,1932,1984,2060,2127,2204,2279,2422,2519,2589,2693,2758,2879,2980,3138,3274,3387,3518,3631,3749,3855,3982,4122,4271,4403,4568,4759,4989,5246,5494,5662,5935,6260,6522,6860,7239,7553,7876,8191,8530,8882,9218,9570,9957,10324,10662,10991,11329,11767,12238,12729,13207,13715,14305,14852,15369,15890,16424,16968,17524,18112,18684,19267,19801,20324,20837,21374,21916,22464,22990]
[null,null,"Bahamas",250343,-773963,0,0,0,0,0,0,0,0,0,0,0,0,0,0,0,0,0,0,0,0,0,0,0,0,0,0,0,0,0,0,0,0,0,0,0,0,0,0,0,0,0,0,0,0,0,0,0,0,0,0,0,0,0,0,1,1,1,3,3,4,4,4,5,5,9,10,10,11,14,14,21,24,24,28,28,29,33,40,41,42,46,46,47,49,49,53,54,55,55,60,65,65,72,73,78,80,80,80,80,81,81,83,83,83,89,92,92,92,92,92,93,93,94,96,96,96,96,96,96,97,97,97,100,100,100,100,100,101,102,102,102,102,102,102,102,102,103,103,103,103,103,103,103,103,103,103,104,104,104,104,104,104,104,104,104,104,104,104,104,104,104,104,104,104,104,104,104,104,106,107,108]
[null,null,"Bahrain",260275,"50.55",0,0,0,0,0,0,0,0,0,0,0,0,0,0,0,0,0,0,0,0,0,0,0,0,0,0,0,0,0,0,0,0,0,1,23,33,33,36,41,47,49,49,52,55,60,85,85,95,110,195,195,195,210,214,214,228,256,278,285,305,334,377,392,419,458,466,476,499,515,567,569,643,672,688,700,756,811,823,887,925,1040,1136,1361,1528,1671,1700,1740,1773,1881,1907,1973,2027,2217,2518,2588,2647,2723,2811,2921,3040,3170,3284,3383,3533,3720,3934,4199,4444,4774,4941,5236,5531,5816,6198,6583,6747,6956,7184,7532,7888,8174,8414,8802,9138,9171,9366,9692,10052,10449,10793,11398,11871,12311,12815,13296,13835,14383,14763,15417,15731,16200,16667,17269,17713,18227,19013,19553,19961,20430,20916,21331,21764,22407,23062,23570,24081,24805,25267,25705,26239,26758,27414,27837,28410,28857,29367,29821,30321,30931,31528,32039]
[null,null,"Bangladesh",23685,903563,0,0,0,0,0,0,0,0,0,0,0,0,0,0,0,0,0,0,0,0,0,0,0,0,0,0,0,0,0,0,0,0,0,0,0,0,0,0,0,0,0,0,0,0,0,0,3,3,3,3,3,3,3,5,8,10,14,17,20,25,27,33,39,39,44,48,48,48,49,51,54,56,61,70,88,123,164,218,330,424,482,621,803,1012,1231,1572,1838,2144,2456,2948,3382,3772,4186,4689,4998,5416,5913,6462,7103,7667,8238,8790,9455,10143,10929,11719,12425,13134,13770,14657,15691,16660,17822,18863,20065,20995,22268,23870,25121,26738,28511,30205,32078,33610,35585,36751,38292,40321,42844,44608,47153,49534,52445,55140,57563,60391,63026,65769,68504,71675,74865,78052,81523,84379,87520,90619,94481,98489,102292,105535,108775,112306,115786,119198,122660,126606,130474,133978,137787,141801,145483,149258,153277,156391,159679,162417,165618,168645,172134,175494,178443]
[null,null,"Barbados",131939,-595432,0,0,0,0,0,0,0,0,0,0,0,0,0,0,0,0,0,0,0,0,0,0,0,0,0,0,0,0,0,0,0,0,0,0,0,0,0,0,0,0,0,0,0,0,0,0,0,0,0,0,0,0,0,0,0,2,2,5,5,6,14,17,18,18,18,24,26,33,33,34,34,46,51,52,56,60,63,63,66,67,68,71,72,72,73,75,75,75,75,75,75,75,76,77,79,79,80,80,80,81,81,81,82,82,82,82,82,83,84,84,84,85,85,85,85,86,88,88,90,90,90,90,92,92,92,92,92,92,92,92,92,92,92,92,92,92,92,92,92,92,96,96,96,96,96,97,97,97,97,97,97,97,97,97,97,97,97,97,97,97,97,97,97,97,97,98,98,98,98,98,98]
[null,null,"Belarus",537098,279534,0,0,0,0,0,0,0,0,0,0,0,0,0,0,0,0,0,0,0,0,0,0,0,0,0,0,0,0,0,0,0,0,0,0,0,0,0,1,1,1,1,1,6,6,6,6,6,6,9,9,12,27,27,27,36,36,51,51,69,76,76,81,81,86,86,94,94,94,152,152,163,304,351,440,562,700,861,1066,1486,1981,2226,2578,2919,3281,3728,4204,4779,5297,5807,6264,6723,7281,8022,8773,9590,10463,11289,12208,13181,14027,14917,15828,16705,17489,18350,19255,20168,21101,22052,22973,23906,24873,25825,26772,27730,28681,29650,30572,31508,32426,33371,34303,35244,36198,37144,38059,38956,39858,40764,41658,42556,43403,44255,45116,45981,46868,47751,48630,49453,50265,51066,51816,52520,53241,53973,54680,55369,56032,56657,57333,57936,58505,59023,59487,59945,60382,60713,61095,61475,61790,62118,62424,62698,62997,63270,63554,63804,64003,64224,64411,64604]
[null,null,"Belgium",508333,"4.0",0,0,0,0,0,0,0,0,0,0,0,0,0,1,1,1,1,1,1,1,1,1,1,1,1,1,1,1,1,1,1,1,1,1,1,1,1,1,1,2,8,13,23,50,109,169,200,239,267,314,314,559,689,886,1058,1243,1486,1795,2257,2815,3401,3743,4269,4937,6235,7284,9134,10836,11899,12775,13964,15348,16770,18431,19691,20814,22194,23403,24983,26667,28018,29647,30589,31119,33573,34809,36138,37183,38496,39983,40956,41889,42797,44293,45325,46134,46687,47334,47859,48519,49032,49517,49906,50267,50509,50781,51420,52011,52596,53081,53449,53779,53981,54288,54644,54989,55280,55559,55791,55983,56235,56511,56810,57092,57342,57455,57592,57849,58061,58186,58381,58517,58615,58685,58767,58907,59072,59226,59348,59437,59569,59711,59819,59918,60029,60100,60155,60244,60348,60476,60550,60550,60550,60810,60898,61007,61106,61209,61295,61361,61427,61509,61598,61727,61838,62016,62058,62058,62123,62210,62357]
[null,null,"Benin",93077,23158,0,0,0,0,0,0,0,0,0,0,0,0,0,0,0,0,0,0,0,0,0,0,0,0,0,0,0,0,0,0,0,0,0,0,0,0,0,0,0,0,0,0,0,0,0,0,0,0,0,0,0,0,0,0,1,1,2,2,2,2,2,5,6,6,6,6,6,6,6,9,13,13,16,16,22,26,26,26,26,35,35,35,35,35,35,35,35,35,35,54,54,54,54,54,54,64,64,64,64,64,90,90,90,96,96,96,140,242,284,319,319,327,327,339,339,339,339,339,130,130,135,135,135,191,191,208,210,210,224,224,232,243,244,244,261,261,261,261,288,305,305,305,388,412,442,483,532,572,597,650,650,765,807,850,902,1017,1053,1124,1149,1187,1199,1199,1199,1199,1199,1199,1199,1199,1199,1285,1285]
[null,null,"Bhutan",275142,904336,0,0,0,0,0,0,0,0,0,0,0,0,0,0,0,0,0,0,0,0,0,0,0,0,0,0,0,0,0,0,0,0,0,0,0,0,0,0,0,0,0,0,0,0,1,1,1,1,1,1,1,1,1,1,1,1,1,1,2,2,2,2,2,2,2,3,3,4,4,4,4,5,5,5,5,5,5,5,5,5,5,5,5,5,5,5,5,5,5,5,6,6,7,7,7,7,7,7,7,7,7,7,7,7,7,7,7,7,7,7,9,11,15,20,21,21,21,21,21,21,21,21,24,24,27,27,28,31,31,33,43,43,47,47,47,48,48,59,59,59,59,62,62,66,66,67,67,67,67,68,68,68,68,70,70,70,70,75,76,77,77,77,77,77,78,80,80,80,80,80,80]
[null,null,"Bolivia",-162902,-635887,0,0,0,0,0,0,0,0,0,0,0,0,0,0,0,0,0,0,0,0,0,0,0,0,0,0,0,0,0,0,0,0,0,0,0,0,0,0,0,0,0,0,0,0,0,0,0,0,0,2,2,3,10,10,11,11,12,12,15,19,24,27,29,32,43,61,74,81,97,107,115,123,132,139,157,183,194,210,264,268,275,300,330,354,397,441,465,493,520,564,598,609,703,807,866,950,1014,1053,1110,1167,1229,1470,1594,1681,1802,1886,2081,2266,2437,2556,2831,2964,3148,3372,3577,3826,4088,4263,4481,4919,5187,5579,5915,6263,6660,7136,7768,8387,8731,9592,9982,10531,10991,11638,12245,12728,13358,13643,13949,14644,15281,16165,16929,17842,18459,19073,19883,20685,21499,22476,23512,24388,25493,26389,27487,28503,29423,30676,31524,32125,33219,34227,35528,36818,38071,39297,40509,41545,42984,44113,45565]
[null,null,"Bosnia and Herzegovina",439159,176791,0,0,0,0,0,0,0,0,0,0,0,0,0,0,0,0,0,0,0,0,0,0,0,0,0,0,0,0,0,0,0,0,0,0,0,0,0,0,0,0,0,0,0,2,2,3,3,3,5,7,11,13,18,24,25,26,38,63,89,93,126,136,166,176,191,237,258,323,368,420,459,533,579,624,654,674,764,804,858,901,946,1009,1037,1083,1110,1167,1214,1268,1285,1309,1342,1368,1413,1421,1486,1516,1565,1585,1677,1757,1781,1839,1857,1926,1946,1987,2027,2070,2090,2117,2141,2158,2181,2218,2236,2267,2290,2304,2321,2338,2350,2372,2391,2401,2406,2416,2435,2462,2485,2494,2510,2524,2535,2551,2594,2606,2606,2606,2704,2728,2775,2832,2893,2893,2893,3040,3085,3141,3174,3273,3273,3273,3525,3588,3676,3796,3935,3935,3935,4325,4453,4606,4788,4962,4962,4962,5458,5621,5869,6086,6402]
[null,null,"Brazil",-14235,-519253,0,0,0,0,0,0,0,0,0,0,0,0,0,0,0,0,0,0,0,0,0,0,0,0,0,0,0,0,0,0,0,0,0,0,0,1,1,1,2,2,2,2,4,4,13,13,20,25,31,38,52,151,151,162,200,321,372,621,793,1021,1546,1924,2247,2554,2985,3417,3904,4256,4579,5717,6836,8044,9056,10360,11130,12161,14034,16170,18092,19638,20727,22192,23430,25262,28320,30425,33682,36658,38654,40743,43079,45757,50036,54043,59324,63100,67446,73235,79685,87187,92202,97100,101826,108620,115455,126611,135773,146894,156061,162699,169594,178214,190137,203165,220291,233511,241080,255368,271885,291579,310087,330890,347398,363211,374898,391222,411821,438238,465166,498440,514849,526447,555383,584016,614941,645771,672846,691758,707412,739503,772416,802828,828810,850514,867624,888271,923189,955377,978142,1032913,1067579,1083341,1106470,1145906,1188631,1228114,1274974,1313667,1344143,1368195,1402041,1448753,1496858,1539081,1577004,1603055,1623284,1668589,1713160,1755779,1800827]
[null,null,"Brunei",45353,1147277,0,0,0,0,0,0,0,0,0,0,0,0,0,0,0,0,0,0,0,0,0,0,0,0,0,0,0,0,0,0,0,0,0,0,0,0,0,0,0,0,0,0,0,0,0,0,0,1,1,11,11,37,40,50,54,56,68,75,78,83,88,91,104,109,114,115,120,126,127,129,131,133,134,135,135,135,135,135,135,136,136,136,136,136,136,136,136,137,138,138,138,138,138,138,138,138,138,138,138,138,138,138,138,138,138,139,141,141,141,141,141,141,141,141,141,141,141,141,141,141,141,141,141,141,141,141,141,141,141,141,141,141,141,141,141,141,141,141,141,141,141,141,141,141,141,141,141,141,141,141,141,141,141,141,141,141,141,141,141,141,141,141,141,141,141,141,141,141,141,141,141]
[null,null,"Bulgaria",427339,254858,0,0,0,0,0,0,0,0,0,0,0,0,0,0,0,0,0,0,0,0,0,0,0,0,0,0,0,0,0,0,0,0,0,0,0,0,0,0,0,0,0,0,0,0,0,0,4,4,4,7,7,23,41,51,52,67,92,94,127,163,187,201,218,242,264,293,331,346,359,399,422,457,485,503,531,549,577,593,618,635,661,675,685,713,747,800,846,878,894,929,975,1024,1097,1234,1247,1300,1363,1399,1447,1506,1555,1594,1618,1652,1704,1778,1829,1872,1921,1965,1990,2023,2069,2100,2138,2175,2211,2235,2259,2292,2331,2372,2408,2427,2433,2443,2460,2477,2485,2499,2513,2519,2538,2560,2585,2627,2711,2727,2810,2889,2993,3086,3191,3266,3290,3341,3453,3542,3674,3755,3872,3905,3984,4114,4242,4408,4513,4625,4691,4831,4989,5154,5315,5497,5677,5740,5914,6102,6342,6672,6964]
[null,null,"Burkina Faso",122383,-15616,0,0,0,0,0,0,0,0,0,0,0,0,0,0,0,0,0,0,0,0,0,0,0,0,0,0,0,0,0,0,0,0,0,0,0,0,0,0,0,0,0,0,0,0,0,0,0,0,1,2,2,2,2,3,15,15,20,33,40,64,75,99,114,146,152,180,207,222,246,261,282,288,302,318,345,364,384,414,443,443,484,497,497,528,542,546,557,565,576,581,600,609,616,629,629,632,635,638,641,645,649,652,662,672,688,729,736,744,748,751,760,766,773,773,780,782,796,796,796,809,812,814,814,814,832,832,845,847,847,847,847,847,881,884,885,888,888,889,890,891,891,892,892,892,894,894,895,899,899,900,901,903,903,907,919,934,941,941,959,959,962,962,967,980,987,987,1000,1003,1003,1005,1020]
[null,null,"Cabo Verde",165388,-230418,0,0,0,0,0,0,0,0,0,0,0,0,0,0,0,0,0,0,0,0,0,0,0,0,0,0,0,0,0,0,0,0,0,0,0,0,0,0,0,0,0,0,0,0,0,0,0,0,0,0,0,0,0,0,0,0,0,0,1,3,3,3,3,4,4,5,5,6,6,6,6,6,6,7,7,7,7,7,7,7,8,8,10,11,56,56,56,58,61,67,68,73,82,88,90,106,109,114,114,121,122,152,165,175,186,191,218,230,236,246,260,267,289,315,326,328,328,328,335,349,356,362,371,380,390,390,390,390,405,421,435,458,466,477,502,536,542,554,567,585,615,657,697,726,750,760,781,792,823,848,863,890,944,982,999,1003,1027,1091,1155,1165,1227,1267,1301,1382,1421,1451,1463,1499,1542,1552,1591]
[null,null,"Cambodia","1955-11-01",1049167,0,0,0,0,0,1,1,1,1,1,1,1,1,1,1,1,1,1,1,1,1,1,1,1,1,1,1,1,1,1,1,1,1,1,1,1,1,1,1,1,1,1,1,1,1,1,2,2,2,3,3,5,7,7,7,33,35,37,51,53,84,87,91,96,96,99,99,103,107,109,109,110,114,114,114,114,115,117,119,119,120,122,122,122,122,122,122,122,122,122,122,122,122,122,122,122,122,122,122,122,122,122,122,122,122,122,122,122,122,122,122,122,122,122,122,122,122,122,122,122,123,123,124,124,124,124,124,124,124,125,125,125,125,125,125,125,125,126,126,126,126,126,126,128,128,128,128,128,129,129,129,129,130,130,130,130,139,141,141,141,141,141,141,141,141,141,141,141,141,141,141]
[null,null,"Cameroon",3.848E+16,115021,0,0,0,0,0,0,0,0,0,0,0,0,0,0,0,0,0,0,0,0,0,0,0,0,0,0,0,0,0,0,0,0,0,0,0,0,0,0,0,0,0,0,0,0,1,1,2,2,2,2,2,2,2,2,4,10,10,13,20,27,40,56,66,75,75,91,91,139,139,193,233,306,509,555,650,658,658,730,730,820,820,820,820,848,848,996,996,1017,1017,1163,1163,1163,1334,1430,1518,1621,1705,1705,1832,1832,1832,2077,2077,2104,2104,2265,2267,2267,2274,2579,2689,2689,2800,2954,3105,3105,3105,3529,3529,3733,4288,4400,4400,4890,4890,5436,5436,5436,5436,5904,5904,6397,6585,6585,6789,7392,7599,7908,8060,8312,8681,8681,8681,8681,8681,9864,9864,9864,9864,10638,11610,11892,12041,12270,12592,12592,12592,12592,12592,12592,12592,12592,12592,12592,12592,12592,12592,14916,14916,14916,14916]
[null,"Alberta","Canada",539333,-1165765,0,0,0,0,0,0,0,0,0,0,0,0,0,0,0,0,0,0,0,0,0,0,0,0,0,0,0,0,0,0,0,0,0,0,0,0,0,0,0,0,0,0,0,0,1,2,4,7,7,19,19,29,29,39,56,74,97,119,146,195,259,301,359,358,486,542,542,621,661,690,754,969,969,1075,1181,1250,1373,1373,1423,1451,1567,1567,1732,1870,1870,1996,2397,2562,2803,2908,3095,3401,3720,4017,4233,4480,4696,4850,5165,5355,5573,5670,5766,5836,5893,5963,6017,6098,6157,6253,6300,6345,6407,6457,6515,6587,6644,6683,6716,6735,6768,6800,6818,6860,6879,6901,6926,6955,6979,6992,7010,7044,7057,7076,7091,7098,7138,7138,7202,7229,7276,7316,7346,7383,7433,7453,7482,7530,7579,7625,7673,7704,7736,7781,7825,7851,7888,7957,7996,8067,8108,8108,8202,8259,8259,8259,8389,8436,8482,8519,8596]
[null,"British Columbia","Canada",492827,-1231207,0,0,0,0,0,0,1,1,1,1,1,1,1,1,2,2,4,4,4,4,4,4,4,4,4,4,5,5,5,5,6,6,6,6,7,7,7,7,8,8,8,9,12,13,21,21,27,32,32,39,46,64,64,73,103,103,186,231,271,424,424,472,617,617,725,725,884,884,970,1013,1013,1121,1174,1203,1203,1266,1266,1291,1336,1370,1445,1445,1490,1490,1517,1561,1575,1618,1647,1647,1724,1795,1824,1853,1948,1948,1998,2053,2087,2112,2145,2171,2171,2224,2232,2255,2288,2315,2330,2330,2353,2360,2376,2392,2407,2428,2428,2444,2446,2467,2479,2507,2517,2517,2530,2541,2550,2558,2562,2573,2573,2597,2601,2623,2632,2632,2632,2632,2659,2669,2680,2694,2709,2709,2709,2745,2756,2775,2783,2790,2790,2790,2822,2835,2849,2869,2878,2878,2878,2904,2916,2916,2940,2947,2947,2947,2978,2990,3008,3028,3053]
[null,"Grand Princess","Canada",376489,-1226655,0,0,0,0,0,0,0,0,0,0,0,0,0,0,0,0,0,0,0,0,0,0,0,0,0,0,0,0,0,0,0,0,0,0,0,0,0,0,0,0,0,0,0,0,0,0,0,0,0,0,0,2,2,2,2,8,9,9,10,10,13,13,13,13,13,13,13,13,13,13,13,13,13,13,13,13,13,13,13,13,13,13,13,13,13,13,13,13,13,13,13,13,13,13,13,13,13,13,13,13,13,13,13,13,13,13,13,13,13,13,13,13,13,13,13,13,13,13,13,13,13,13,13,13,13,13,13,13,13,13,13,13,13,13,13,13,13,13,13,13,13,13,13,13,13,13,13,13,13,13,13,13,13,13,13,13,13,13,13,13,13,13,13,13,13,13,13,13,13,13,13]
[null,"Manitoba","Canada",537609,-988139,0,0,0,0,0,0,0,0,0,0,0,0,0,0,0,0,0,0,0,0,0,0,0,0,0,0,0,0,0,0,0,0,0,0,0,0,0,0,0,0,0,0,0,0,0,0,0,0,0,0,0,4,4,4,7,8,15,17,17,18,20,20,21,35,36,39,64,72,96,103,127,167,182,182,203,203,217,217,221,230,243,242,246,246,246,250,250,253,254,254,255,257,262,263,267,271,273,273,275,277,281,282,282,283,284,286,283,284,284,287,289,290,290,289,289,289,289,290,290,290,290,292,292,292,292,292,292,294,294,294,295,295,297,298,298,300,300,300,300,300,300,300,301,303,304,304,304,306,308,311,313,313,314,314,315,316,318,322,322,324,325,325,325,325,325,325,325,325,325,325,325]
[null,"New Brunswick","Canada",465653,-664619,0,0,0,0,0,0,0,0,0,0,0,0,0,0,0,0,0,0,0,0,0,0,0,0,0,0,0,0,0,0,0,0,0,0,0,0,0,0,0,0,0,0,0,0,0,0,0,0,0,1,1,1,1,2,6,8,11,11,11,17,17,17,18,18,33,45,51,66,68,70,81,91,91,91,98,103,105,105,108,112,112,114,116,116,117,117,117,117,118,118,118,118,118,118,118,118,118,118,118,118,118,118,118,118,119,120,120,120,120,120,120,120,120,120,120,120,120,120,120,120,121,121,121,121,121,122,123,126,128,129,132,132,133,135,136,136,136,137,146,147,151,153,154,157,157,160,163,164,164,164,164,164,164,165,165,165,165,165,165,165,165,165,165,165,165,165,165,165,165,166,166]
[null,"Newfoundland and Labrador","Canada",531355,-576604,0,0,0,0,0,0,0,0,0,0,0,0,0,0,0,0,0,0,0,0,0,0,0,0,0,0,0,0,0,0,0,0,0,0,0,0,0,0,0,0,0,0,0,0,0,0,0,0,0,0,0,0,0,1,1,3,3,3,4,6,9,24,35,35,82,102,120,135,148,152,175,183,195,195,217,226,228,228,232,239,241,242,244,244,247,252,256,257,257,257,257,256,256,256,257,258,258,258,258,258,259,259,259,259,259,259,261,261,261,261,261,261,261,261,260,260,260,260,260,260,260,260,260,260,260,260,260,261,261,261,261,261,261,261,261,261,261,261,261,261,261,261,261,261,261,261,261,261,261,261,261,261,261,261,261,261,261,261,261,261,261,261,261,261,261,261,261,261,261,261,262]
[null,"Nova Scotia","Canada",4.4681999999999904E+16,-637443,0,0,0,0,0,0,0,0,0,0,0,0,0,0,0,0,0,0,0,0,0,0,0,0,0,0,0,0,0,0,0,0,0,0,0,0,0,0,0,0,0,0,0,0,0,0,0,0,0,0,0,0,0,0,5,7,12,14,15,21,28,41,51,68,73,90,110,122,127,147,173,193,207,236,262,293,310,310,342,407,428,445,474,517,549,579,606,649,675,721,737,772,827,850,865,873,900,915,935,947,959,963,971,985,991,998,1007,1008,1011,1018,1019,1020,1024,1026,1034,1037,1040,1043,1044,1045,1046,1048,1049,1050,1051,1052,1053,1055,1055,1056,1056,1057,1057,1058,1058,1058,1058,1059,1059,1060,1061,1061,1061,1061,1061,1061,1061,1061,1061,1061,1061,1061,1061,1061,1061,1061,1061,1061,1061,1061,1062,1063,1064,1064,1064,1064,1065,1065,1066,1066,1066]
[null,"Ontario","Canada",512538,-853232,0,0,0,0,1,1,1,1,1,3,3,3,3,3,3,3,3,3,3,3,3,3,3,3,3,3,3,3,3,3,3,3,3,4,4,4,6,6,11,15,18,20,20,22,25,28,29,34,36,41,42,74,79,104,177,185,221,257,308,377,425,503,588,688,858,994,1144,1355,1706,1966,2392,2793,3255,3630,4354,4347,4726,5276,5759,6237,6648,7049,7470,7953,8447,9840,10456,11013,11561,12063,12715,13718,14068,14550,15012,15568,15970,16500,16978,17395,17880,18321,18574,19097,19468,19910,20388,20826,21148,21469,21817,22158,22516,22865,23258,23645,23974,24286,24755,25197,25595,26085,26560,26897,27302,27624,27943,28320,28700,29023,29390,29845,30259,30603,30946,31359,31620,32096,32395,32678,32936,33173,33378,33625,33806,33986,34174,34382,34574,34780,35044,35217,35418,35657,35861,36046,36151,36322,36597,36823,36961,37085,37242,37407,37525,37653,37829,37917,38079,38200,38323]
[null,"Prince Edward Island","Canada",465107,-634168,0,0,0,0,0,0,0,0,0,0,0,0,0,0,0,0,0,0,0,0,0,0,0,0,0,0,0,0,0,0,0,0,0,0,0,0,0,0,0,0,0,0,0,0,0,0,0,0,0,0,0,0,0,1,1,1,1,2,2,2,3,3,3,5,5,9,11,11,18,21,21,22,22,22,22,22,22,25,25,25,25,25,25,25,26,26,26,26,26,26,26,26,26,26,26,26,26,27,27,27,27,27,27,27,27,27,27,27,27,27,27,27,27,27,27,27,27,27,27,27,27,27,27,27,27,27,27,27,27,27,27,27,27,27,27,27,27,27,27,27,27,27,27,27,27,27,27,27,27,27,27,27,27,27,27,27,27,27,27,27,27,27,27,27,30,32,32,32,32,33,33]
[null,"Quebec","Canada",529399,-735491,0,0,0,0,0,0,0,0,0,0,0,0,0,0,0,0,0,0,0,0,0,0,0,0,0,0,0,0,0,0,0,0,0,0,0,0,0,1,1,1,1,1,1,2,2,3,4,4,4,8,9,17,17,24,50,74,94,121,139,181,219,628,1013,1342,1632,2024,2498,2840,3430,4162,4611,5518,6101,6101,7944,8580,9340,10031,10912,11677,12292,12846,13557,14248,14860,15857,16798,17521,17950,19319,20126,20965,21838,22616,23267,24109,24983,25761,26610,27550,28656,29664,31873,32631,33425,34334,35249,36161,36997,37732,38480,39235,39940,40732,41429,42192,42928,43636,44206,44784,45504,46150,46847,47420,47993,48607,49148,49711,50232,50651,51059,51354,51593,51884,52143,52398,52624,52849,53047,53185,53341,53485,53666,53824,53952,54054,54146,54263,54383,54550,54674,54766,54835,54884,54937,55079,55079,55079,55079,55390,55458,55524,55593,55682,55784,55863,55937,55997,56079,56216,56316]
[null,"Saskatchewan","Canada",529399,-1064509,0,0,0,0,0,0,0,0,0,0,0,0,0,0,0,0,0,0,0,0,0,0,0,0,0,0,0,0,0,0,0,0,0,0,0,0,0,0,0,0,0,0,0,0,0,0,0,0,0,0,0,2,2,2,7,7,8,16,20,26,52,66,72,72,95,95,134,156,156,184,193,206,220,220,249,249,260,260,271,285,289,298,300,300,304,305,307,313,315,316,320,326,331,341,349,353,365,366,383,389,415,421,433,467,487,512,531,544,553,564,568,573,577,582,590,591,592,592,599,620,622,627,630,632,634,634,637,639,641,645,646,646,646,647,648,649,650,650,654,656,658,660,663,664,665,683,684,693,708,716,726,746,751,753,757,759,772,777,778,779,785,785,795,796,796,796,805,806,808,813,815]
[null,null,"Central African Republic",66111,209394,0,0,0,0,0,0,0,0,0,0,0,0,0,0,0,0,0,0,0,0,0,0,0,0,0,0,0,0,0,0,0,0,0,0,0,0,0,0,0,0,0,0,0,0,0,0,0,0,0,0,0,0,0,1,1,1,1,1,3,3,3,3,3,3,3,3,3,3,3,3,3,3,8,8,8,8,8,8,8,8,8,8,11,11,12,12,12,12,12,12,14,14,16,16,16,19,19,50,50,50,72,72,72,85,85,94,94,143,143,143,143,143,143,143,301,327,327,327,366,418,436,479,552,604,652,671,702,755,874,962,1011,1069,1069,1173,1288,1451,1570,1634,1850,1850,1888,1952,2044,2057,2057,2222,2410,2564,2605,2605,2686,2808,2963,3051,3099,3244,3340,3429,3429,3613,3745,3745,3788,3918,3969,3969,4033,4071,4109,4200,4259]
[null,null,"Chad",154542,187322,0,0,0,0,0,0,0,0,0,0,0,0,0,0,0,0,0,0,0,0,0,0,0,0,0,0,0,0,0,0,0,0,0,0,0,0,0,0,0,0,0,0,0,0,0,0,0,0,0,0,0,0,0,0,0,0,0,1,1,1,1,1,3,3,3,3,3,3,5,7,7,8,8,9,9,9,10,10,11,11,11,18,23,23,23,27,27,33,33,33,33,33,33,40,46,46,46,52,52,73,73,117,117,117,170,170,253,260,322,322,322,357,372,399,428,474,503,519,545,565,588,611,648,675,687,700,715,726,759,759,778,790,803,820,828,836,836,837,839,844,846,848,848,848,850,850,853,854,854,858,858,858,858,860,860,863,865,865,866,866,866,866,868,871,871,872,872,873,873,873,874]
[null,null,"Chile",-356751,-71543,0,0,0,0,0,0,0,0,0,0,0,0,0,0,0,0,0,0,0,0,0,0,0,0,0,0,0,0,0,0,0,0,0,0,0,0,0,0,0,0,0,1,1,4,4,4,8,8,13,23,23,43,61,74,155,201,238,238,434,537,632,746,922,1142,1306,1610,1909,2139,2449,2738,3031,3404,3737,4161,4471,4815,5116,5546,5972,6501,6927,7213,7525,7917,8273,8807,9252,9730,10088,10507,10832,11296,11812,12306,12858,13331,13813,14365,14885,16023,17008,18435,19663,20643,22016,23048,24581,25972,27219,28866,30063,31721,34381,37040,39542,41428,43781,46059,49579,53617,57581,61857,65393,69102,73997,77961,82289,86943,90638,94858,99688,105158,108686,113628,118292,122499,127745,134150,138846,142759,148456,154092,160846,167355,174293,179436,184449,220628,225103,231393,236748,242355,246963,250767,254416,259064,263360,267766,271982,275999,279393,282043,284541,288089,291847,295532,298557,301019,303083,306216,309274]
[null,"Anhui","China",318257,1172264,1,9,15,39,60,70,106,152,200,237,297,340,408,480,530,591,665,733,779,830,860,889,910,934,950,962,973,982,986,987,988,989,989,989,989,989,989,990,990,990,990,990,990,990,990,990,990,990,990,990,990,990,990,990,990,990,990,990,990,990,990,990,990,990,990,990,990,990,990,990,990,990,990,990,990,990,990,990,991,991,991,991,991,991,991,991,991,991,991,991,991,991,991,991,991,991,991,991,991,991,991,991,991,991,991,991,991,991,991,991,991,991,991,991,991,991,991,991,991,991,991,991,991,991,991,991,991,991,991,991,991,991,991,991,991,991,991,991,991,991,991,991,991,991,991,991,991,991,991,991,991,991,991,991,991,991,991,991,991,991,991,991,991,991,991,991,991,991,991,991,991]
[null,"Beijing","China",401824,1164142,14,22,36,41,68,80,91,111,114,139,168,191,212,228,253,274,297,315,326,337,342,352,366,372,375,380,381,387,393,395,396,399,399,399,400,400,410,410,411,413,414,414,418,418,422,426,428,428,429,435,435,436,437,442,452,456,469,480,491,504,522,537,558,561,566,569,573,577,577,580,580,582,584,585,586,587,587,588,588,588,589,589,589,589,590,593,593,593,593,593,593,593,593,593,593,593,593,593,593,593,593,593,593,593,593,593,593,593,593,593,593,593,593,593,593,593,593,593,593,593,593,593,593,593,593,593,593,593,593,593,593,593,593,594,594,594,594,594,594,594,594,595,601,637,673,700,731,752,777,777,821,830,843,850,863,874,891,905,912,919,922,923,925,926,928,929,929,929,929,929,929]
[null,"Chongqing","China",300572,107874,6,9,27,57,75,110,132,147,182,211,247,300,337,366,389,411,426,428,468,486,505,518,529,537,544,551,553,555,560,567,572,573,575,576,576,576,576,576,576,576,576,576,576,576,576,576,576,576,576,576,576,576,576,576,576,576,576,576,576,576,577,578,578,578,578,578,578,579,579,579,579,579,579,579,579,579,579,579,579,579,579,579,579,579,579,579,579,579,579,579,579,579,579,579,579,579,579,579,579,579,579,579,579,579,579,579,579,579,579,579,579,579,579,579,579,579,579,579,579,579,579,579,579,579,579,579,579,579,579,579,579,579,579,579,579,579,579,579,579,579,579,579,579,580,582,582,582,582,582,582,582,582,582,582,582,582,582,582,582,582,582,582,582,582,582,582,582,582,582,582,582]
[null,"Fujian","China",260789,1179874,1,5,10,18,35,59,80,84,101,120,144,159,179,194,205,215,224,239,250,261,267,272,279,281,285,287,290,292,293,293,293,293,293,293,294,294,296,296,296,296,296,296,296,296,296,296,296,296,296,296,296,296,296,296,296,296,296,296,299,303,313,313,318,322,328,331,337,338,340,343,345,345,349,350,350,350,351,351,351,351,351,352,352,353,353,353,354,355,355,355,355,355,355,355,355,355,355,355,355,356,356,356,356,356,356,356,356,356,356,356,356,356,356,356,356,356,356,356,356,356,356,356,356,356,357,357,358,358,358,358,358,358,358,358,358,358,359,359,359,359,360,361,361,361,362,362,362,362,362,362,363,363,363,363,363,363,363,363,363,363,363,363,363,363,363,363,363,363,363,363,363]
[null,"Gansu","China",378099,1010583,0,2,2,4,7,14,19,24,26,29,40,51,55,57,62,62,67,79,83,83,86,87,90,90,90,90,91,91,91,91,91,91,91,91,91,91,91,91,91,91,91,91,91,102,119,120,124,124,125,127,127,127,129,133,133,133,133,134,134,134,136,136,136,136,136,136,136,138,138,138,138,138,138,138,138,139,139,139,139,139,139,139,139,139,139,139,139,139,139,139,139,139,139,139,139,139,139,139,139,139,139,139,139,139,139,139,139,139,139,139,139,139,139,139,139,139,139,139,139,139,139,139,139,139,139,139,139,139,139,139,139,139,139,139,139,139,139,139,139,139,139,139,139,139,139,139,149,150,151,151,151,151,158,158,161,161,162,163,163,164,164,164,164,164,167,167,167,167,167,167,167]
[null,"Guangdong","China",233417,1134244,26,32,53,78,111,151,207,277,354,436,535,632,725,813,895,970,1034,1095,1131,1159,1177,1219,1241,1261,1294,1316,1322,1328,1331,1332,1333,1339,1342,1345,1347,1347,1347,1348,1349,1349,1350,1350,1350,1351,1352,1352,1352,1352,1353,1356,1356,1356,1356,1360,1361,1364,1370,1378,1395,1400,1413,1415,1428,1433,1448,1456,1467,1475,1484,1494,1501,1507,1514,1516,1524,1532,1533,1536,1539,1544,1548,1552,1555,1564,1566,1571,1577,1579,1580,1581,1582,1582,1585,1585,1586,1587,1587,1588,1588,1588,1588,1588,1588,1588,1588,1589,1589,1589,1589,1589,1589,1589,1589,1589,1589,1590,1590,1590,1590,1590,1590,1591,1592,1592,1592,1592,1592,1592,1593,1593,1595,1596,1597,1598,1598,1601,1602,1602,1604,1604,1607,1607,1608,1625,1625,1628,1628,1628,1631,1631,1634,1634,1634,1634,1635,1635,1637,1637,1637,1641,1641,1642,1642,1643,1643,1643,1643,1645,1647,1647,1647]
[null,"Guangxi","China",238298,1087881,2,5,23,23,36,46,51,58,78,87,100,111,127,139,150,168,172,183,195,210,215,222,222,226,235,237,238,242,244,245,246,249,249,251,252,252,252,252,252,252,252,252,252,252,252,252,252,252,252,252,252,252,252,252,252,253,253,253,254,254,254,254,254,254,254,254,254,254,254,254,254,254,254,254,254,254,254,254,254,254,254,254,254,254,254,254,254,254,254,254,254,254,254,254,254,254,254,254,254,254,254,254,254,254,254,254,254,254,254,254,254,254,254,254,254,254,254,254,254,254,254,254,254,254,254,254,254,254,254,254,254,254,254,254,254,254,254,254,254,254,254,254,254,254,254,254,254,254,254,254,254,254,254,254,254,254,254,254,254,254,254,254,254,254,254,254,254,254,254,254,254]
[null,"Guizhou","China",268154,1068748,1,3,3,4,5,7,9,9,12,29,29,38,46,58,64,71,81,89,99,109,127,133,135,140,143,144,146,146,146,146,146,146,146,146,146,146,146,146,146,146,146,146,146,146,146,146,146,146,146,146,146,146,146,146,146,147,146,146,146,146,146,146,146,146,146,146,146,146,146,146,146,146,146,146,146,146,146,146,146,146,146,146,146,146,146,146,146,146,147,147,147,147,147,147,147,147,147,147,147,147,147,147,147,147,147,147,147,147,147,147,147,147,147,147,147,147,147,147,147,147,147,147,147,147,147,147,147,147,147,147,147,147,147,147,147,147,147,147,147,147,147,147,147,147,147,147,147,147,147,147,147,147,147,147,147,147,147,147,147,147,147,147,147,147,147,147,147,147,147,147,147]
[null,"Hainan","China",191959,1097453,4,5,8,19,22,33,40,43,46,52,62,64,72,80,99,106,117,124,131,138,144,157,157,159,162,162,163,163,168,168,168,168,168,168,168,168,168,168,168,168,168,168,168,168,168,168,168,168,168,168,168,168,168,168,168,168,168,168,168,168,168,168,168,168,168,168,168,168,168,168,168,168,168,168,168,168,168,168,168,168,168,168,168,168,168,168,168,168,168,168,168,168,168,168,168,168,168,168,168,168,168,168,168,168,168,168,168,168,168,168,168,168,168,168,169,169,169,169,169,169,169,169,169,169,169,169,169,169,169,169,169,169,169,169,169,169,170,170,170,170,170,170,171,171,171,171,171,171,171,171,171,171,171,171,171,171,171,171,171,171,171,171,171,171,171,171,171,171,171,171,171]
[null,"Hebei","China",39549,1161306,1,1,2,8,13,18,33,48,65,82,96,104,113,126,135,157,172,195,206,218,239,251,265,283,291,300,301,306,306,307,308,309,311,311,311,312,317,318,318,318,318,318,318,318,318,318,318,318,318,318,318,318,318,318,318,318,318,318,318,318,319,319,319,319,319,319,319,319,321,321,323,325,326,326,327,327,327,327,327,327,327,327,327,327,327,328,328,328,328,328,328,328,328,328,328,328,328,328,328,328,328,328,328,328,328,328,328,328,328,328,328,328,328,328,328,328,328,328,328,328,328,328,328,328,328,328,328,328,328,328,328,328,328,328,328,328,328,328,328,328,328,328,328,328,331,335,336,338,340,340,344,346,346,348,349,349,349,349,349,349,349,349,349,349,349,349,349,349,349,349,349]
[null,"Heilongjiang","China",4.7861999999999904E+16,1277615,0,2,4,9,15,21,33,38,44,59,80,95,121,155,190,227,277,295,307,331,360,378,395,419,425,445,457,464,470,476,479,479,480,480,480,480,480,480,480,480,480,480,480,481,481,481,481,481,481,482,482,482,482,482,482,482,482,483,484,484,484,484,484,484,484,484,484,484,484,484,484,488,489,491,504,524,544,569,609,638,661,684,740,819,841,861,872,892,898,905,913,921,928,930,935,936,939,939,939,944,944,944,944,944,944,944,944,944,944,945,945,945,945,945,945,945,945,945,945,945,945,945,945,945,945,945,945,945,945,945,945,945,945,947,947,947,947,947,947,947,947,947,947,947,947,947,947,947,947,947,947,947,947,947,947,947,947,947,947,947,947,947,947,947,947,947,947,947,947,947,947]
[null,"Henan","China",33882,1.13613999999999E+16,5,5,9,32,83,128,168,206,278,352,422,493,566,675,764,851,914,981,1033,1073,1105,1135,1169,1184,1212,1231,1246,1257,1262,1265,1267,1270,1271,1271,1271,1271,1272,1272,1272,1272,1272,1272,1272,1272,1272,1272,1272,1272,1272,1273,1273,1273,1273,1273,1273,1273,1273,1273,1273,1273,1274,1274,1274,1274,1275,1275,1275,1276,1276,1276,1276,1276,1276,1276,1276,1276,1276,1276,1276,1276,1276,1276,1276,1276,1276,1276,1276,1276,1276,1276,1276,1276,1276,1276,1276,1276,1276,1276,1276,1276,1276,1276,1276,1276,1276,1276,1276,1276,1276,1276,1276,1276,1276,1276,1276,1276,1276,1276,1276,1276,1276,1276,1276,1276,1276,1276,1276,1276,1276,1276,1276,1276,1276,1276,1276,1276,1276,1276,1276,1276,1276,1276,1276,1276,1276,1276,1276,1276,1276,1276,1276,1276,1276,1276,1276,1276,1276,1276,1276,1276,1276,1276,1276,1276,1276,1276,1276,1276,1276,1276,1276]
[null,"Hong Kong","China","2020-03-22","114.2",0,2,2,5,8,8,8,10,10,12,13,15,15,17,21,24,25,26,29,38,49,50,53,56,56,57,60,62,63,68,68,69,74,79,84,91,92,94,95,96,100,100,105,105,107,108,114,115,120,126,129,134,140,145,155,162,181,208,256,273,317,356,386,410,453,519,561,641,682,714,765,802,845,862,890,914,935,960,973,989,1000,1004,1009,1012,1017,1017,1021,1024,1025,1025,1029,1033,1035,1035,1037,1037,1037,1037,1037,1037,1039,1039,1039,1040,1040,1040,1044,1044,1044,1047,1047,1047,1050,1051,1052,1052,1055,1055,1055,1055,1055,1065,1065,1065,1065,1065,1066,1066,1079,1082,1084,1087,1093,1093,1099,1102,1105,1106,1107,1107,1107,1107,1108,1109,1109,1112,1112,1120,1124,1124,1128,1131,1161,1177,1179,1193,1196,1197,1199,1203,1205,1233,1242,1247,1258,1268,1285,1299,1323,1365,1365]
[null,"Hubei","China",309756,1122707,444,444,549,761,1058,1423,3554,3554,4903,5806,7153,11177,13522,16678,19665,22112,24953,27100,29631,31728,33366,33366,48206,54406,56249,58182,59989,61682,62031,62442,62662,64084,64084,64287,64786,65187,65596,65914,66337,66907,67103,67217,67332,67466,67592,67666,67707,67743,67760,67773,67781,67786,67790,67794,67798,67799,67800,67800,67800,67800,67800,67800,67801,67801,67801,67801,67801,67801,67801,67801,67802,67802,67802,67803,67803,67803,67803,67803,67803,67803,67803,67803,67803,67803,67803,67803,68128,68128,68128,68128,68128,68128,68128,68128,68128,68128,68128,68128,68128,68128,68128,68128,68128,68128,68128,68128,68128,68128,68129,68134,68134,68134,68134,68134,68134,68134,68134,68135,68135,68135,68135,68135,68135,68135,68135,68135,68135,68135,68135,68135,68135,68135,68135,68135,68135,68135,68135,68135,68135,68135,68135,68135,68135,68135,68135,68135,68135,68135,68135,68135,68135,68135,68135,68135,68135,68135,68135,68135,68135,68135,68135,68135,68135,68135,68135,68135,68135,68135,68135,68135,68135]
[null,"Hunan","China",276104,1117088,4,9,24,43,69,100,143,221,277,332,389,463,521,593,661,711,772,803,838,879,912,946,968,988,1001,1004,1006,1007,1008,1010,1011,1013,1016,1016,1016,1016,1017,1017,1018,1018,1018,1018,1018,1018,1018,1018,1018,1018,1018,1018,1018,1018,1018,1018,1018,1018,1018,1018,1018,1018,1018,1018,1018,1018,1018,1018,1018,1018,1018,1018,1018,1019,1019,1019,1019,1019,1019,1019,1019,1019,1019,1019,1019,1019,1019,1019,1019,1019,1019,1019,1019,1019,1019,1019,1019,1019,1019,1019,1019,1019,1019,1019,1019,1019,1019,1019,1019,1019,1019,1019,1019,1019,1019,1019,1019,1019,1019,1019,1019,1019,1019,1019,1019,1019,1019,1019,1019,1019,1019,1019,1019,1019,1019,1019,1019,1019,1019,1019,1019,1019,1019,1019,1019,1019,1019,1019,1019,1019,1019,1019,1019,1019,1019,1019,1019,1019,1019,1019,1019,1019,1019,1019,1019,1019,1019,1019,1019,1019,1019,1019,1019]
[null,"Inner Mongolia","China",440935,1139448,0,0,1,7,7,11,15,16,19,20,23,27,34,35,42,46,50,52,54,58,58,60,61,65,68,70,72,73,75,75,75,75,75,75,75,75,75,75,75,75,75,75,75,75,75,75,75,75,75,75,75,75,75,75,75,75,75,75,75,75,75,75,75,77,89,92,94,95,97,107,111,117,117,117,117,118,121,124,126,128,155,189,190,190,190,193,193,193,193,194,194,194,194,197,198,198,199,199,200,201,201,201,201,201,201,201,201,201,201,208,209,209,209,209,209,209,213,216,216,216,216,217,217,227,232,232,232,232,232,232,235,235,235,235,235,235,235,235,235,237,237,237,237,237,237,238,238,238,238,238,238,238,238,238,238,238,238,238,238,238,238,238,238,238,238,239,240,244,244,244,244]
[null,"Jiangsu","China",329711,119455,1,5,9,18,33,47,70,99,129,168,202,236,271,308,341,373,408,439,468,492,515,543,570,593,604,617,626,629,631,631,631,631,631,631,631,631,631,631,631,631,631,631,631,631,631,631,631,631,631,631,631,631,631,631,631,631,631,631,631,631,633,633,636,638,640,641,641,644,645,646,646,647,651,651,651,651,651,651,651,651,652,653,653,653,653,653,653,653,653,653,653,653,653,653,653,653,653,653,653,653,653,653,653,653,653,653,653,653,653,653,653,653,653,653,653,653,653,653,653,653,653,653,653,653,653,653,653,653,653,653,653,653,653,653,653,653,653,653,653,653,653,653,653,653,653,653,653,653,653,653,653,653,654,654,654,654,654,654,654,654,654,654,654,654,654,654,654,654,654,654,654]
[null,"Jiangxi","China",27614,1157221,2,7,18,18,36,72,109,109,162,240,286,333,391,476,548,600,661,698,740,771,804,844,872,900,913,925,930,933,934,934,934,934,934,934,934,934,934,935,935,935,935,935,935,935,935,935,935,935,935,935,935,935,935,935,935,935,935,935,935,935,936,936,936,936,936,936,936,937,937,937,937,937,937,937,937,937,937,937,937,937,937,937,937,937,937,937,937,937,937,937,937,937,937,937,937,937,937,937,937,937,937,937,937,937,937,937,937,937,937,937,937,937,937,937,937,937,937,937,937,937,937,937,937,937,937,937,937,937,937,937,937,937,937,932,932,932,932,932,932,932,932,932,932,932,932,932,932,932,932,932,932,932,932,932,932,932,932,932,932,932,932,932,932,932,932,932,932,932,932,932,932]
[null,"Jilin","China",436661,1261923,0,1,3,4,4,6,8,9,14,14,17,23,31,42,54,59,65,69,78,80,81,83,84,86,88,89,89,89,90,91,91,91,91,93,93,93,93,93,93,93,93,93,93,93,93,93,93,93,93,93,93,93,93,93,93,93,93,93,93,93,93,93,93,94,95,95,97,98,98,98,98,98,98,98,98,98,98,98,98,98,98,99,100,100,102,102,102,102,104,104,106,106,108,109,109,110,110,110,111,111,112,112,112,112,112,112,113,113,124,127,127,133,134,138,140,144,146,151,151,151,151,154,155,155,155,155,155,155,155,155,155,155,155,155,155,155,155,155,155,155,155,155,155,155,155,155,155,155,155,155,155,155,155,155,155,155,155,155,155,155,155,155,155,155,155,155,155,155,155,155,155]
[null,"Liaoning","China",412956,1226085,2,3,4,17,21,27,34,39,41,48,64,70,74,81,89,94,99,105,107,108,111,116,117,119,119,121,121,121,121,121,121,121,121,121,121,121,121,121,121,122,122,125,125,125,125,125,125,125,125,125,125,125,125,125,125,125,125,125,126,126,127,127,127,127,128,128,132,134,136,139,140,141,141,141,142,142,144,144,144,144,145,145,145,145,145,145,146,146,146,146,146,146,146,146,146,146,146,146,146,146,146,146,146,146,146,146,146,146,146,147,147,147,149,149,149,149,149,149,149,149,149,149,149,149,149,149,149,149,149,149,149,149,149,149,149,149,149,149,149,149,149,149,149,151,151,152,152,152,153,153,153,154,154,154,154,154,154,154,155,155,155,155,156,156,156,157,157,159,162,162,162]
[null,"Macau","China",221667,"113.55",1,2,2,2,5,6,7,7,7,7,7,8,8,10,10,10,10,10,10,10,10,10,10,10,10,10,10,10,10,10,10,10,10,10,10,10,10,10,10,10,10,10,10,10,10,10,10,10,10,10,10,10,10,10,11,12,15,17,17,18,24,24,25,30,31,33,37,37,38,41,41,41,43,43,44,44,44,45,45,45,45,45,45,45,45,45,45,45,45,45,45,45,45,45,45,45,45,45,45,45,45,45,45,45,45,45,45,45,45,45,45,45,45,45,45,45,45,45,45,45,45,45,45,45,45,45,45,45,45,45,45,45,45,45,45,45,45,45,45,45,45,45,45,45,45,45,45,45,45,45,45,45,45,45,45,46,46,46,46,46,46,46,46,46,46,46,46,46,46,46,46]
[null,"Ningxia","China",372692,1061655,1,1,2,3,4,7,11,12,17,21,26,28,31,34,34,40,43,45,45,49,53,58,64,67,70,70,70,70,71,71,71,71,71,71,71,71,72,72,73,73,74,74,75,75,75,75,75,75,75,75,75,75,75,75,75,75,75,75,75,75,75,75,75,75,75,75,75,75,75,75,75,75,75,75,75,75,75,75,75,75,75,75,75,75,75,75,75,75,75,75,75,75,75,75,75,75,75,75,75,75,75,75,75,75,75,75,75,75,75,75,75,75,75,75,75,75,75,75,75,75,75,75,75,75,75,75,75,75,75,75,75,75,75,75,75,75,75,75,75,75,75,75,75,75,75,75,75,75,75,75,75,75,75,75,75,75,75,75,75,75,75,75,75,75,75,75,75,75,75,75,75]
[null,"Qinghai","China",357452,959956,0,0,0,1,1,6,6,6,8,8,9,11,13,15,17,18,18,18,18,18,18,18,18,18,18,18,18,18,18,18,18,18,18,18,18,18,18,18,18,18,18,18,18,18,18,18,18,18,18,18,18,18,18,18,18,18,18,18,18,18,18,18,18,18,18,18,18,18,18,18,18,18,18,18,18,18,18,18,18,18,18,18,18,18,18,18,18,18,18,18,18,18,18,18,18,18,18,18,18,18,18,18,18,18,18,18,18,18,18,18,18,18,18,18,18,18,18,18,18,18,18,18,18,18,18,18,18,18,18,18,18,18,18,18,18,18,18,18,18,18,18,18,18,18,18,18,18,18,18,18,18,18,18,18,18,18,18,18,18,18,18,18,18,18,18,18,18,18,18,18,18]
[null,"Shaanxi","China",351917,1088701,0,3,5,15,22,35,46,56,63,87,101,116,128,142,165,173,184,195,208,213,219,225,229,230,232,236,240,240,242,245,245,245,245,245,245,245,245,245,245,245,245,245,245,245,245,245,245,245,245,245,245,245,245,245,245,246,246,246,247,248,248,248,249,250,253,253,253,253,253,253,255,255,255,256,256,256,256,256,256,256,256,256,256,256,256,256,256,256,256,256,277,279,279,286,286,286,286,306,306,306,306,306,306,306,308,308,308,308,308,308,308,308,308,308,308,308,308,308,308,308,308,308,308,308,308,308,308,308,308,308,308,309,309,309,309,309,311,311,311,311,311,311,311,311,313,313,313,314,314,314,316,317,317,319,319,319,319,320,320,320,320,320,320,320,320,321,321,321,321,321,321]
[null,"Shandong","China",363427,1181498,2,6,15,27,46,75,95,130,158,184,206,230,259,275,307,347,386,416,444,466,487,497,509,523,532,537,541,543,544,546,749,750,754,755,756,756,756,756,756,758,758,758,758,758,758,758,758,758,758,760,760,760,760,760,760,761,761,761,762,764,767,768,768,769,771,772,772,772,773,774,774,775,778,778,779,780,781,783,783,783,784,784,784,784,784,784,787,787,787,787,787,787,787,787,787,787,787,787,787,787,787,787,788,788,788,788,788,788,788,788,788,788,788,788,788,788,788,788,788,788,788,788,788,788,788,788,788,788,790,792,792,792,792,792,792,792,792,792,792,792,792,792,792,792,792,792,792,792,792,792,792,792,792,792,792,792,792,792,792,792,792,792,792,792,792,792,792,792,792,792,792]
[null,"Shanghai","China",3.12019999999999E+16,1214491,9,16,20,33,40,53,66,96,112,135,169,182,203,219,243,257,277,286,293,299,303,311,315,318,326,328,333,333,333,334,334,335,335,335,336,337,337,337,337,337,337,338,338,339,342,342,342,342,344,344,344,346,353,353,355,358,361,363,371,380,404,404,414,433,451,468,485,492,498,509,516,522,526,529,531,536,538,543,552,555,555,607,618,618,622,628,628,628,635,638,638,639,641,641,642,642,644,645,647,652,652,652,655,656,656,657,657,657,659,659,659,660,660,660,665,665,666,666,666,666,666,667,668,668,669,670,671,671,672,672,672,673,673,673,677,677,677,678,678,678,684,689,690,691,692,695,695,697,697,697,698,701,701,703,703,705,706,707,708,712,712,713,714,715,716,716,716,718,721,721,721]
[null,"Shanxi","China",375777,1122922,1,1,1,6,9,13,27,27,35,39,47,66,74,81,81,96,104,115,119,119,124,126,126,127,128,129,130,131,131,132,132,132,132,133,133,133,133,133,133,133,133,133,133,133,133,133,133,133,133,133,133,133,133,133,133,133,133,133,133,133,133,134,134,134,135,135,135,136,136,136,137,137,137,137,138,138,138,163,166,168,172,172,173,173,186,194,197,197,197,197,197,197,197,197,197,197,197,197,197,197,197,197,198,198,198,198,198,198,198,198,198,198,198,198,198,198,198,198,198,198,198,198,198,198,198,198,198,198,198,198,198,198,198,198,198,198,198,198,198,198,198,198,198,198,198,198,198,198,198,198,198,198,198,198,198,198,198,198,198,198,198,198,198,198,198,198,198,199,199,199,199]
[null,"Sichuan","China",306171,1027103,5,8,15,28,44,69,90,108,142,177,207,231,254,282,301,321,344,364,386,405,417,436,451,463,470,481,495,508,514,520,525,526,526,527,529,531,534,538,538,538,538,538,538,539,539,539,539,539,539,539,539,539,539,539,539,540,540,540,541,542,543,543,545,547,547,548,548,550,550,550,552,554,555,557,558,559,560,560,560,560,560,560,560,560,560,560,560,561,561,561,561,561,561,561,561,561,561,561,561,561,561,561,561,561,561,561,561,561,561,561,561,561,561,561,561,561,561,561,561,561,561,563,563,564,564,564,564,564,564,564,575,577,577,577,578,578,578,581,582,582,582,582,583,583,587,588,589,589,589,589,589,589,589,589,589,589,589,589,592,595,595,595,595,595,596,596,596,598,599,599,599]
[null,"Tianjin","China",393054,117323,4,4,8,10,14,23,24,27,31,32,41,48,60,67,69,79,81,88,91,95,106,112,119,120,122,124,125,128,130,131,132,135,135,135,135,135,136,136,136,136,136,136,136,136,136,136,136,136,136,136,136,136,136,136,136,136,136,137,137,137,137,141,145,145,151,155,161,166,174,174,176,176,180,180,180,180,180,180,182,183,183,183,184,185,185,186,189,189,189,189,189,189,189,190,190,190,190,190,190,190,190,190,190,190,190,190,190,191,191,191,191,191,191,191,191,192,192,192,192,192,192,192,192,192,192,192,192,192,192,192,192,192,192,192,192,192,193,193,193,194,195,195,196,196,196,196,196,197,197,197,197,197,198,198,198,198,198,198,198,198,198,198,198,198,199,199,199,199,199,199,199]
[null,"Tibet","China",316927,880924,0,0,0,0,0,0,0,0,1,1,1,1,1,1,1,1,1,1,1,1,1,1,1,1,1,1,1,1,1,1,1,1,1,1,1,1,1,1,1,1,1,1,1,1,1,1,1,1,1,1,1,1,1,1,1,1,1,1,1,1,1,1,1,1,1,1,1,1,1,1,1,1,1,1,1,1,1,1,1,1,1,1,1,1,1,1,1,1,1,1,1,1,1,1,1,1,1,1,1,1,1,1,1,1,1,1,1,1,1,1,1,1,1,1,1,1,1,1,1,1,1,1,1,1,1,1,1,1,1,1,1,1,1,1,1,1,1,1,1,1,1,1,1,1,1,1,1,1,1,1,1,1,1,1,1,1,1,1,1,1,1,1,1,1,1,1,1,1,1,1,1]
[null,"Xinjiang","China",411129,852401,0,2,2,3,4,5,10,13,14,17,18,21,24,29,32,36,39,42,45,49,55,59,63,65,70,71,75,76,76,76,76,76,76,76,76,76,76,76,76,76,76,76,76,76,76,76,76,76,76,76,76,76,76,76,76,76,76,76,76,76,76,76,76,76,76,76,76,76,76,76,76,76,76,76,76,76,76,76,76,76,76,76,76,76,76,76,76,76,76,76,76,76,76,76,76,76,76,76,76,76,76,76,76,76,76,76,76,76,76,76,76,76,76,76,76,76,76,76,76,76,76,76,76,76,76,76,76,76,76,76,76,76,76,76,76,76,76,76,76,76,76,76,76,76,76,76,76,76,76,76,76,76,76,76,76,76,76,76,76,76,76,76,76,76,76,76,76,76,76,76,76]
[null,"Yunnan","China",24974,1.01487E+16,1,2,5,11,16,26,44,55,70,83,93,105,117,122,128,133,138,138,141,149,153,154,156,162,168,171,171,172,172,174,174,174,174,174,174,174,174,174,174,174,174,174,174,174,174,174,174,174,174,174,174,174,174,174,176,176,176,176,176,176,176,176,176,176,178,180,180,180,180,182,182,183,184,184,184,184,184,184,184,184,184,184,184,184,184,184,184,184,184,184,184,184,184,185,185,185,185,185,185,185,185,185,185,185,185,185,185,185,185,185,185,185,185,185,185,185,185,185,185,185,185,185,185,185,185,185,185,185,185,185,185,185,185,185,185,185,185,185,185,185,185,185,185,185,185,185,185,185,185,185,185,185,185,185,185,185,185,185,185,185,185,185,186,186,186,186,186,187,187,187,187]
[null,"Zhejiang","China",291832,1200934,10,27,43,62,104,128,173,296,428,538,599,661,724,829,895,954,1006,1048,1075,1092,1117,1131,1145,1155,1162,1167,1171,1172,1174,1175,1203,1205,1205,1205,1205,1205,1205,1205,1205,1205,1206,1213,1213,1215,1215,1215,1215,1215,1215,1215,1215,1215,1227,1231,1231,1232,1232,1233,1234,1236,1238,1238,1240,1241,1243,1247,1251,1254,1255,1257,1257,1258,1260,1262,1263,1264,1265,1266,1267,1267,1267,1267,1267,1267,1268,1268,1268,1268,1268,1268,1268,1268,1268,1268,1268,1268,1268,1268,1268,1268,1268,1268,1268,1268,1268,1268,1268,1268,1268,1268,1268,1268,1268,1268,1268,1268,1268,1268,1268,1268,1268,1268,1268,1268,1268,1268,1268,1268,1268,1268,1268,1268,1268,1268,1268,1268,1268,1268,1268,1268,1268,1268,1268,1268,1268,1268,1269,1269,1269,1269,1269,1269,1269,1269,1269,1269,1269,1269,1269,1269,1269,1269,1269,1269,1269,1269,1269,1269,1269,1269,1269]
[null,null,"Colombia",45709,-742973,0,0,0,0,0,0,0,0,0,0,0,0,0,0,0,0,0,0,0,0,0,0,0,0,0,0,0,0,0,0,0,0,0,0,0,0,0,0,0,0,0,0,0,0,1,1,1,1,3,9,9,13,22,34,54,65,93,102,128,196,231,277,378,470,491,539,608,702,798,906,1065,1161,1267,1406,1485,1579,1780,2054,2223,2473,2709,2776,2852,2979,3105,3233,3439,3439,3792,3977,4149,4356,4561,4881,5142,5379,5597,5949,6207,6507,7006,7285,7668,7973,8613,8959,9456,10051,10495,11063,11613,12272,12930,13610,14216,14939,15574,16295,16935,17687,18330,19131,20177,21175,21981,23003,24104,24141,25406,26734,27219,29384,30593,31935,33466,36759,36759,38149,40847,40847,42206,43810,45344,46994,48896,53168,53211,55083,57202,60387,63454,68836,71367,73760,73760,77313,80811,84660,91995,91995,95269,98090,102261,106392,109793,113685,117412,120281,124494,128638,133973]
[null,null,"Congo (Brazzaville)",-40383,217587,0,0,0,0,0,0,0,0,0,0,0,0,0,0,0,0,0,0,0,0,0,0,0,0,0,0,0,0,0,0,0,0,0,0,0,0,0,0,0,0,0,0,0,0,0,0,0,0,0,0,0,0,0,1,1,1,1,3,3,3,3,4,4,4,4,4,4,19,19,19,19,22,22,22,45,45,45,45,60,60,60,60,60,60,117,117,143,143,143,160,165,186,186,200,200,200,200,207,207,220,229,229,229,236,236,264,264,274,274,274,333,333,333,391,391,391,391,412,420,420,469,469,487,487,487,487,571,571,571,571,611,611,611,611,611,635,683,683,683,728,728,728,728,728,728,883,883,883,883,883,883,883,1087,1087,1087,1087,1087,1087,1087,1087,1087,1382,1382,1557,1557,1557,1557,1557,1821,1821,2028]
[null,null,"Congo (Kinshasa)",-40383,217587,0,0,0,0,0,0,0,0,0,0,0,0,0,0,0,0,0,0,0,0,0,0,0,0,0,0,0,0,0,0,0,0,0,0,0,0,0,0,0,0,0,0,0,0,0,0,0,0,0,1,1,2,2,2,2,3,4,14,18,23,30,36,45,48,51,51,65,65,81,98,109,134,134,154,154,161,180,180,180,215,223,234,235,241,254,267,287,307,327,332,350,359,377,394,416,442,459,471,491,572,604,674,674,682,705,797,863,937,937,991,1024,1102,1169,1242,1298,1455,1455,1538,1629,1731,1835,1945,2025,2141,2297,2403,2546,2660,2833,2966,3070,3195,3326,3495,3644,3764,3878,4016,4106,4259,4390,4515,4637,4724,4778,4837,4974,5100,5283,5477,5672,5826,5924,6027,6213,6411,6552,6690,6827,6939,7039,7122,7189,7311,7379,7411,7432,7432,7432,7846,7905]
[null,null,"Costa Rica",97489,-837534,0,0,0,0,0,0,0,0,0,0,0,0,0,0,0,0,0,0,0,0,0,0,0,0,0,0,0,0,0,0,0,0,0,0,0,0,0,0,0,0,0,0,0,0,1,1,5,9,9,13,22,23,26,27,35,41,50,69,89,117,134,158,177,201,231,263,295,314,330,347,375,396,416,435,454,467,483,502,539,558,577,595,612,618,626,642,649,655,660,662,669,681,686,687,693,695,697,705,713,719,725,733,739,742,755,761,765,773,780,792,801,804,815,830,843,853,863,866,882,897,903,911,918,930,951,956,984,1000,1022,1047,1056,1084,1105,1157,1194,1228,1263,1318,1342,1375,1461,1538,1612,1662,1715,1744,1796,1871,1939,2058,2127,2213,2277,2368,2515,2684,2836,2979,3130,3269,3459,3753,4023,4311,4621,4996,5241,5486,5836,6485,6845]
[null,null,"Cote d'Ivoire","1954-07-01",-55471,0,0,0,0,0,0,0,0,0,0,0,0,0,0,0,0,0,0,0,0,0,0,0,0,0,0,0,0,0,0,0,0,0,0,0,0,0,0,0,0,0,0,0,0,0,0,0,0,0,1,1,1,1,1,1,5,6,9,9,14,14,25,73,80,96,101,101,165,168,179,190,194,218,245,261,323,349,384,444,444,533,574,626,638,638,654,688,801,847,847,916,952,1004,1077,1077,1150,1164,1183,1238,1275,1333,1362,1398,1432,1464,1516,1571,1602,1667,1700,1730,1857,1912,1971,2017,2061,2109,2119,2153,2231,2301,2341,2366,2376,2423,2477,2556,2641,2750,2799,2833,2951,3024,3110,3262,3431,3557,3739,3881,3995,4181,4404,4684,4848,5084,5439,5679,6063,6444,6874,7276,7492,7677,7904,8164,8334,8739,8944,9101,9214,9499,9702,9992,10244,10462,10772,10966,11194,11504,11750,12052]
[null,null,"Croatia","45.1","2020-02-15",0,0,0,0,0,0,0,0,0,0,0,0,0,0,0,0,0,0,0,0,0,0,0,0,0,0,0,0,0,0,0,0,0,0,1,3,3,5,6,7,7,9,10,10,11,12,12,12,14,19,19,32,38,49,57,65,81,105,128,206,254,315,382,442,495,586,657,713,790,867,963,1011,1079,1126,1182,1222,1282,1343,1407,1495,1534,1600,1650,1704,1741,1791,1814,1832,1871,1881,1908,1950,1981,2009,2016,2030,2039,2047,2062,2076,2085,2088,2096,2101,2112,2119,2125,2161,2176,2187,2196,2207,2213,2221,2222,2224,2226,2228,2232,2234,2237,2243,2243,2244,2244,2244,2244,2245,2245,2246,2246,2246,2246,2246,2247,2247,2247,2247,2247,2247,2249,2249,2249,2251,2252,2254,2255,2258,2269,2280,2299,2317,2336,2366,2388,2483,2539,2624,2691,2725,2777,2831,2912,3008,3094,3151,3220,3272,3325,3416,3532]
[null,null,"Diamond Princess","0.0","0.0",0,0,0,0,0,0,0,0,0,0,0,0,0,0,0,0,61,61,64,135,135,175,175,218,285,355,454,542,621,634,634,634,691,691,691,705,705,705,705,705,705,706,706,706,706,706,706,706,706,706,706,706,706,706,706,706,712,712,712,712,712,712,712,712,712,712,712,712,712,712,712,712,712,712,712,712,712,712,712,712,712,712,712,712,712,712,712,712,712,712,712,712,712,712,712,712,712,712,712,712,712,712,712,712,712,712,712,712,712,712,712,712,712,712,712,712,712,712,712,712,712,712,712,712,712,712,712,712,712,712,712,712,712,712,712,712,712,712,712,712,712,712,712,712,712,712,712,712,712,712,712,712,712,712,712,712,712,712,712,712,712,712,712,712,712,712,712,712,712,712,712]
[null,null,"Cuba","22.0","-80.0",0,0,0,0,0,0,0,0,0,0,0,0,0,0,0,0,0,0,0,0,0,0,0,0,0,0,0,0,0,0,0,0,0,0,0,0,0,0,0,0,0,0,0,0,0,0,0,0,0,0,3,4,4,4,4,5,7,11,16,21,35,40,48,57,67,80,119,139,170,186,212,233,269,288,320,350,396,457,515,564,620,669,726,766,814,862,923,986,1035,1087,1137,1189,1235,1285,1337,1369,1389,1437,1467,1501,1537,1611,1649,1668,1685,1703,1729,1741,1754,1766,1783,1804,1810,1830,1840,1862,1872,1881,1887,1900,1908,1916,1931,1941,1947,1963,1974,1983,2005,2025,2045,2083,2092,2107,2119,2133,2173,2191,2200,2205,2211,2219,2233,2238,2248,2262,2273,2280,2295,2305,2309,2312,2315,2318,2319,2321,2325,2330,2332,2340,2341,2348,2353,2361,2369,2372,2380,2395,2399,2403,2413]
[null,null,"Cyprus",351264,334299,0,0,0,0,0,0,0,0,0,0,0,0,0,0,0,0,0,0,0,0,0,0,0,0,0,0,0,0,0,0,0,0,0,0,0,0,0,0,0,0,0,0,0,0,0,0,0,2,3,6,6,14,26,26,33,46,49,67,67,84,95,116,124,132,146,162,179,214,230,262,320,356,396,426,446,465,494,526,564,595,616,633,662,695,715,735,750,761,767,772,784,790,795,804,810,817,822,837,843,850,857,864,872,874,878,883,889,891,892,898,901,903,905,907,910,914,916,917,918,922,923,927,927,935,937,939,939,941,942,944,944,949,952,958,958,960,960,964,970,972,974,975,980,980,983,985,985,985,985,985,985,986,988,990,991,992,992,994,994,996,998,999,999,999,1002,1003,1004,1005,1008,1010,1013]
[null,null,"Czechia",498175,1.54729999999999E+16,0,0,0,0,0,0,0,0,0,0,0,0,0,0,0,0,0,0,0,0,0,0,0,0,0,0,0,0,0,0,0,0,0,0,0,0,0,0,0,3,3,5,8,12,18,19,31,31,41,91,94,141,189,253,298,396,464,694,833,995,1120,1236,1394,1654,1925,2279,2631,2817,3001,3308,3508,3858,4091,4472,4587,4822,5017,5312,5569,5732,5831,5991,6059,6111,6216,6433,6549,6606,6746,6900,7033,7132,7187,7273,7352,7404,7445,7504,7579,7682,7737,7755,7781,7819,7896,7974,8031,8077,8095,8123,8176,8221,8269,8351,8406,8455,8475,8586,8647,8721,8754,8813,8890,8955,9002,9050,9086,9140,9196,9230,9268,9302,9364,9438,9494,9529,9567,9628,9697,9751,9824,9855,9938,9991,10024,10064,10111,10162,10280,10406,10448,10498,10523,10650,10777,10870,11038,11298,11603,11805,11954,12046,12178,12319,12440,12515,12566,12685,12814,12919,13001]
[null,"Faroe Islands","Denmark",618926,-69118,0,0,0,0,0,0,0,0,0,0,0,0,0,0,0,0,0,0,0,0,0,0,0,0,0,0,0,0,0,0,0,0,0,0,0,0,0,0,0,0,0,0,1,1,1,1,2,2,2,2,2,3,9,11,18,47,58,72,80,92,115,118,122,132,140,144,155,159,168,169,173,177,179,181,181,183,184,184,184,184,184,184,184,184,184,184,184,184,185,185,185,185,187,187,187,187,187,187,187,187,187,187,187,187,187,187,187,187,187,187,187,187,187,187,187,187,187,187,187,187,187,187,187,187,187,187,187,187,187,187,187,187,187,187,187,187,187,187,187,187,187,187,187,187,187,187,187,187,187,187,187,187,187,187,187,187,187,187,187,187,187,187,187,187,187,188,188,188,188,188,188]
[null,"Greenland","Denmark",717069,-426043,0,0,0,0,0,0,0,0,0,0,0,0,0,0,0,0,0,0,0,0,0,0,0,0,0,0,0,0,0,0,0,0,0,0,0,0,0,0,0,0,0,0,0,0,0,0,0,0,0,0,0,0,0,0,1,1,1,2,2,2,4,4,5,6,6,10,10,10,10,10,10,10,10,11,11,11,11,11,11,11,11,11,11,11,11,11,11,11,11,11,11,11,11,11,11,11,11,11,11,11,11,11,11,11,11,11,11,11,11,11,11,11,11,11,11,11,11,11,11,11,11,11,11,12,12,12,13,13,13,13,13,13,13,13,13,13,13,13,13,13,13,13,13,13,13,13,13,13,13,13,13,13,13,13,13,13,13,13,13,13,13,13,13,13,13,13,13,13,13,13,13]
[null,null,"Denmark",562639,95018,0,0,0,0,0,0,0,0,0,0,0,0,0,0,0,0,0,0,0,0,0,0,0,0,0,0,0,0,0,0,0,0,0,0,0,0,1,1,3,4,4,6,10,10,23,23,35,90,262,442,615,801,827,864,914,977,1057,1151,1255,1326,1395,1450,1591,1724,1877,2046,2201,2395,2577,2860,3107,3386,3757,4077,4369,4681,5071,5402,5635,5819,5996,6174,6318,6511,6681,6879,7073,7242,7384,7515,7695,7912,8073,8210,8445,8575,8698,8851,9008,9158,9311,9407,9523,9670,9821,9938,10083,10218,10319,10429,10513,10591,10667,10713,10791,10858,10927,10968,11044,11117,11182,11230,11289,11360,11387,11428,11480,11512,11593,11633,11669,11699,11734,11771,11811,11875,11924,11948,11962,12001,12016,12035,12099,12139,12193,12217,12250,12294,12344,12391,12391,12391,12527,12561,12615,12636,12675,12675,12675,12751,12768,12794,12815,12832,12832,12832,12878,12888,12900,12916,12946]
[null,null,"Djibouti",118251,425903,0,0,0,0,0,0,0,0,0,0,0,0,0,0,0,0,0,0,0,0,0,0,0,0,0,0,0,0,0,0,0,0,0,0,0,0,0,0,0,0,0,0,0,0,0,0,0,0,0,0,0,0,0,0,0,0,1,1,1,1,1,3,3,11,11,12,14,18,18,30,33,40,49,50,59,90,90,135,135,150,187,214,298,363,435,591,732,732,846,846,945,974,986,999,1008,1023,1035,1072,1077,1089,1097,1112,1112,1116,1120,1124,1133,1135,1189,1210,1227,1256,1268,1284,1309,1331,1401,1518,1618,1828,2047,2270,2270,2270,2468,2468,2697,2914,2914,3194,3354,3569,3779,3935,4054,4123,4169,4207,4278,4331,4373,4398,4441,4449,4465,4501,4539,4545,4557,4565,4565,4582,4599,4617,4630,4635,4643,4643,4643,4656,4682,4704,4715,4736,4736,4792,4822,4878,4889,4955,4968]
[null,null,"Dominican Republic",187357,-701627,0,0,0,0,0,0,0,0,0,0,0,0,0,0,0,0,0,0,0,0,0,0,0,0,0,0,0,0,0,0,0,0,0,0,0,0,0,0,0,1,1,1,1,1,2,2,5,5,5,5,5,5,11,11,11,21,21,34,72,112,202,245,312,392,488,581,719,859,901,1109,1284,1380,1488,1488,1745,1828,1956,2111,2349,2620,2759,2967,3167,3286,3614,3755,4126,4335,4680,4964,5044,5300,5543,5749,5926,6135,6293,6416,6652,6972,7288,7578,7954,8235,8480,8807,9095,9376,9882,10347,10634,10900,11196,11320,11739,12110,12314,12725,13223,13477,13657,13989,14422,14801,15073,15264,15723,16068,16531,16908,17285,17572,17752,18040,18319,18708,19195,19600,20126,20415,20808,21437,22008,22572,22962,23271,23686,24105,24645,25068,25778,26677,27370,27936,28631,29141,29764,30619,31373,31816,32568,33387,34197,35148,36184,37425,38128,38430,39588,40790,41915]
[null,null,"Ecuador",-18312,-781834,0,0,0,0,0,0,0,0,0,0,0,0,0,0,0,0,0,0,0,0,0,0,0,0,0,0,0,0,0,0,0,0,0,0,0,0,0,0,0,6,6,7,10,13,13,13,14,15,15,17,17,17,28,28,37,58,111,199,367,506,789,981,1082,1173,1403,1595,1823,1924,1962,2240,2748,3163,3368,3465,3646,3747,3747,4450,4965,7161,7257,7466,7529,7603,7858,8225,8450,9022,9468,10128,10398,10850,11183,22719,22719,22719,23240,24258,24675,24934,26336,27464,29538,31881,31881,31881,30298,28818,29071,29559,29509,30419,30486,30502,31467,32763,33182,33582,34151,34854,35306,35828,36258,36756,37355,37355,38103,38471,38571,38571,39098,39098,40414,40966,40966,41575,42728,43120,43378,43917,44440,44440,45778,46356,46751,47322,47943,48490,49097,49731,49731,50640,50640,51643,51643,53156,53856,54574,55255,55665,56432,58257,59468,60657,61535,61958,62380,63245,63245,64221,65018]
[null,null,"Egypt","26.0","30.0",0,0,0,0,0,0,0,0,0,0,0,0,0,0,0,0,0,0,0,0,0,0,0,1,1,1,1,1,1,1,1,1,1,1,1,1,1,1,1,2,2,2,2,3,15,15,49,55,59,60,67,80,109,110,150,196,196,256,285,294,327,366,402,456,495,536,576,609,656,710,779,865,985,1070,1173,1322,1450,1560,1699,1794,1939,2065,2190,2350,2505,2673,2844,3032,3144,3333,3490,3659,3891,4092,4319,4534,4782,5042,5268,5537,5895,6193,6465,6813,7201,7588,7981,8476,8964,9400,9746,10093,10431,10829,11228,11719,12229,12764,13484,14229,15003,15786,16513,17265,17967,18756,19666,20793,22082,23449,24985,26384,27536,28615,29767,31115,32612,34079,35444,36829,38284,39726,41303,42980,44598,46289,47856,49219,50437,52211,53758,55233,56809,58141,59561,61130,62755,63923,65188,66754,68311,69814,71299,72711,74035,75253,76222,77279,78304,79254,80235]
[null,null,"El Salvador",137942,-888965,0,0,0,0,0,0,0,0,0,0,0,0,0,0,0,0,0,0,0,0,0,0,0,0,0,0,0,0,0,0,0,0,0,0,0,0,0,0,0,0,0,0,0,0,0,0,0,0,0,0,0,0,0,0,0,0,0,1,1,3,3,3,5,9,13,13,19,24,30,32,32,41,46,56,62,69,78,93,103,117,118,125,137,149,159,164,177,190,201,218,225,237,250,274,274,298,323,345,377,395,424,446,490,555,587,633,695,742,784,889,958,998,1037,1112,1210,1265,1338,1413,1498,1571,1640,1725,1819,1915,1983,2042,2109,2194,2278,2395,2517,2582,2653,2705,2781,2849,2934,3015,3104,3191,3274,3373,3481,3603,3720,3826,3941,4066,4200,4329,4475,4626,4808,4973,5150,5336,5517,5727,5934,6173,6438,6736,7000,7267,7507,7777,8027,8307,8566,8844,9142]
[null,null,"Equatorial Guinea","2020-05-01","10.0",0,0,0,0,0,0,0,0,0,0,0,0,0,0,0,0,0,0,0,0,0,0,0,0,0,0,0,0,0,0,0,0,0,0,0,0,0,0,0,0,0,0,0,0,0,0,0,0,0,0,0,0,0,1,1,1,4,6,6,6,6,9,9,9,12,12,12,12,12,12,15,15,16,16,16,16,16,18,18,18,18,21,21,41,51,51,79,79,79,79,83,84,84,214,258,258,258,315,315,315,315,315,315,315,315,439,439,439,439,439,439,439,522,583,594,594,594,719,825,890,903,960,960,960,1043,1043,1043,1043,1306,1306,1306,1306,1306,1306,1306,1306,1306,1306,1306,1306,1306,1306,1306,1306,1306,1306,1664,1664,1664,1664,1664,1664,1664,1664,1664,2001,2001,2001,2001,2001,2001,2001,3071,3071,3071,3071,3071,3071,3071,3071,3071]
[null,null,"Eritrea",151794,397823,0,0,0,0,0,0,0,0,0,0,0,0,0,0,0,0,0,0,0,0,0,0,0,0,0,0,0,0,0,0,0,0,0,0,0,0,0,0,0,0,0,0,0,0,0,0,0,0,0,0,0,0,0,0,0,0,0,0,0,1,1,1,1,4,6,6,6,12,12,15,15,22,22,29,29,31,31,33,33,34,34,34,34,34,35,35,35,39,39,39,39,39,39,39,39,39,39,39,39,39,39,39,39,39,39,39,39,39,39,39,39,39,39,39,39,39,39,39,39,39,39,39,39,39,39,39,39,39,39,39,39,39,39,39,39,39,39,39,39,39,41,41,41,65,96,109,121,131,142,142,143,143,143,143,144,144,167,191,191,191,203,203,215,215,215,215,215,215,215,232,232]
[null,null,"Estonia",585953,250136,0,0,0,0,0,0,0,0,0,0,0,0,0,0,0,0,0,0,0,0,0,0,0,0,0,0,0,0,0,0,0,0,0,0,0,0,1,1,1,1,1,2,2,3,10,10,10,10,12,16,16,79,115,171,205,225,258,267,283,306,326,352,369,404,538,575,645,679,715,745,779,858,961,1039,1097,1108,1149,1185,1207,1258,1304,1309,1332,1373,1400,1434,1459,1512,1528,1535,1552,1559,1592,1605,1635,1643,1647,1660,1666,1689,1694,1699,1700,1703,1711,1713,1720,1725,1733,1739,1741,1746,1751,1758,1766,1770,1774,1784,1791,1794,1800,1807,1821,1823,1824,1834,1840,1851,1859,1865,1869,1870,1870,1880,1890,1910,1931,1939,1940,1947,1958,1965,1970,1973,1973,1974,1975,1977,1977,1979,1981,1981,1981,1982,1983,1984,1986,1986,1987,1987,1989,1989,1990,1991,1993,1993,1994,1995,2003,2011,2013]
[null,null,"Eswatini",-265225,314659,0,0,0,0,0,0,0,0,0,0,0,0,0,0,0,0,0,0,0,0,0,0,0,0,0,0,0,0,0,0,0,0,0,0,0,0,0,0,0,0,0,0,0,0,0,0,0,0,0,0,0,0,1,1,1,1,1,1,1,1,4,4,4,4,6,9,9,9,9,9,9,9,9,9,9,10,10,12,12,12,12,14,15,15,15,16,16,22,22,24,31,31,31,36,56,59,65,71,91,100,106,108,112,116,119,123,153,159,163,172,175,184,187,187,190,202,203,205,208,217,220,225,238,250,256,261,272,279,279,283,285,293,294,295,300,305,322,333,340,371,398,449,472,486,490,506,520,563,586,623,627,635,643,674,690,706,728,745,781,795,812,840,873,909,954,988,1011,1056,1138,1213,1257]
[null,null,"Ethiopia",9145,404897,0,0,0,0,0,0,0,0,0,0,0,0,0,0,0,0,0,0,0,0,0,0,0,0,0,0,0,0,0,0,0,0,0,0,0,0,0,0,0,0,0,0,0,0,0,0,0,0,0,0,0,1,1,1,5,5,6,6,9,9,11,11,12,12,12,16,16,21,23,26,29,29,35,38,43,44,52,55,56,65,69,71,74,82,85,92,96,105,108,111,114,116,116,117,122,123,124,126,130,131,133,133,135,140,145,162,191,194,210,239,250,261,263,272,287,306,317,352,365,389,399,433,494,582,655,701,731,831,968,1063,1172,1257,1344,1486,1636,1805,1934,2020,2156,2336,2506,2670,2915,3166,3345,3521,3630,3759,3954,4070,4469,4532,4663,4848,5034,5175,5425,5570,5689,5846,5846,5846,5846,5846,5846,5846,5846,5846,6774,6973,7120]
[null,null,"Fiji",-177134,178065,0,0,0,0,0,0,0,0,0,0,0,0,0,0,0,0,0,0,0,0,0,0,0,0,0,0,0,0,0,0,0,0,0,0,0,0,0,0,0,0,0,0,0,0,0,0,0,0,0,0,0,0,0,0,0,0,0,1,1,1,2,3,4,5,5,5,5,5,5,5,5,7,7,12,12,14,15,15,15,16,16,16,16,16,16,17,17,17,17,18,18,18,18,18,18,18,18,18,18,18,18,18,18,18,18,18,18,18,18,18,18,18,18,18,18,18,18,18,18,18,18,18,18,18,18,18,18,18,18,18,18,18,18,18,18,18,18,18,18,18,18,18,18,18,18,18,18,18,18,18,18,18,18,18,18,18,18,18,18,18,18,18,18,18,18,19,21,21,21,26,26]
[null,null,"Finland","64.0","26.0",0,0,0,0,0,0,0,1,1,1,1,1,1,1,1,1,1,1,1,1,1,1,1,1,1,1,1,1,1,1,1,1,1,1,1,2,2,2,3,6,6,6,6,12,15,15,23,30,40,59,59,155,225,244,277,321,336,400,450,523,626,700,792,880,958,1041,1167,1240,1352,1418,1446,1518,1615,1882,1927,2176,2308,2487,2605,2769,2905,2974,3064,3161,3237,3369,3489,3681,3783,3868,4014,4129,4284,4395,4475,4576,4695,4740,4906,4995,5051,5176,5254,5327,5412,5573,5673,5738,5880,5962,5984,6003,6054,6145,6228,6286,6347,6380,6399,6443,6493,6537,6568,6579,6599,6628,6692,6743,6776,6826,6859,6885,6887,6911,6911,6941,6964,6981,7001,7025,7040,7064,7073,7087,7104,7108,7112,7117,7119,7133,7142,7143,7144,7155,7167,7172,7191,7198,7198,7209,7214,7236,7241,7242,7248,7253,7257,7262,7265,7273,7279]
[null,"French Guiana","France",39339,-531258,0,0,0,0,0,0,0,0,0,0,0,0,0,0,0,0,0,0,0,0,0,0,0,0,0,0,0,0,0,0,0,0,0,0,0,0,0,0,0,0,0,0,0,0,0,5,5,5,5,5,5,5,5,7,11,11,11,11,15,18,18,20,23,28,28,28,28,28,43,43,51,51,57,61,61,72,72,77,83,83,83,86,86,86,86,86,96,96,96,97,97,97,107,111,111,111,111,125,125,126,128,128,128,133,133,138,138,141,141,144,144,144,153,164,189,197,197,210,218,237,249,261,279,328,353,384,406,436,450,477,499,499,517,533,556,589,639,689,729,773,865,917,1043,1161,1255,1326,1421,1554,1758,1969,2163,2441,2458,2593,2827,3033,3270,3461,3461,3774,4004,4268,4444,4558,4913,4913,5054,5178,5459,5558,5704]
[null,"French Polynesia","France",-176797,1494068,0,0,0,0,0,0,0,0,0,0,0,0,0,0,0,0,0,0,0,0,0,0,0,0,0,0,0,0,0,0,0,0,0,0,0,0,0,0,0,0,0,0,0,0,0,0,0,0,0,0,0,3,3,3,3,3,3,6,11,15,18,18,25,25,30,30,30,30,36,36,37,37,39,40,41,42,47,51,51,51,51,53,55,55,55,55,55,55,55,56,56,57,57,57,57,57,57,58,58,58,58,58,58,58,60,60,60,60,60,60,60,60,60,60,60,60,60,60,60,60,60,60,60,60,60,60,60,60,60,60,60,60,60,60,60,60,60,60,60,60,60,60,60,60,60,60,60,60,60,60,60,60,60,60,60,60,60,60,62,62,62,62,62,62,62,62,62,62,62,62,62]
[null,"Guadeloupe","France","16.25",-615833,0,0,0,0,0,0,0,0,0,0,0,0,0,0,0,0,0,0,0,0,0,0,0,0,0,0,0,0,0,0,0,0,0,0,0,0,0,0,0,0,0,0,0,0,0,0,0,0,0,0,0,1,1,3,6,18,27,33,45,53,58,62,62,73,73,73,102,106,106,114,125,128,130,134,135,135,139,141,141,143,143,143,143,145,145,145,145,148,148,148,148,148,148,149,149,149,149,149,149,151,152,152,152,152,152,152,153,154,154,154,154,155,155,155,155,155,155,155,155,155,155,156,156,161,161,161,161,161,162,162,162,162,162,162,162,164,164,164,164,164,164,164,171,171,171,171,171,171,171,174,174,174,174,174,174,174,182,182,182,182,182,182,182,184,184,184,184,184,184,184,190]
[null,"Mayotte","France",-128275,451662,0,0,0,0,0,0,0,0,0,0,0,0,0,0,0,0,0,0,0,0,0,0,0,0,0,0,0,0,0,0,0,0,0,0,0,0,0,0,0,0,0,0,0,0,0,0,0,0,0,0,0,0,0,1,1,1,3,3,6,7,11,24,36,36,36,50,63,63,82,94,94,116,128,134,147,147,171,171,184,191,196,196,207,217,217,233,245,254,271,271,311,326,326,354,380,401,401,460,460,539,539,539,650,686,739,739,854,854,988,1023,1023,1095,1143,1210,1210,1312,1342,1370,1370,1475,1475,1521,1521,1587,1609,1634,1645,1670,1699,1699,1699,1934,1986,1993,2058,2079,2079,2079,2151,2175,2226,2240,2268,2282,2298,2310,2333,2345,2383,2394,2404,2404,2434,2434,2467,2508,2508,2508,2508,2560,2603,2643,2650,2661,2661,2661,2679,2688,2688,2702,2711]
[null,"New Caledonia","France",-209043,165618,0,0,0,0,0,0,0,0,0,0,0,0,0,0,0,0,0,0,0,0,0,0,0,0,0,0,0,0,0,0,0,0,0,0,0,0,0,0,0,0,0,0,0,0,0,0,0,0,0,0,0,0,0,0,0,0,0,2,2,4,4,8,10,14,14,15,15,15,15,16,16,18,18,17,18,18,18,18,18,18,18,18,18,18,18,18,18,18,18,18,18,18,18,18,18,18,18,18,18,18,18,18,18,18,18,18,18,18,18,18,18,18,18,18,18,18,18,18,18,18,18,18,18,18,18,18,18,19,19,19,19,20,20,20,20,20,20,20,20,21,21,21,21,21,21,21,21,21,21,21,21,21,21,21,21,21,21,21,21,21,21,21,21,21,21,21,21,21,21,21,21]
[null,"Reunion","France",-211351,552471,0,0,0,0,0,0,0,0,0,0,0,0,0,0,0,0,0,0,0,0,0,0,0,0,0,0,0,0,0,0,0,0,0,0,0,0,0,0,0,0,0,0,0,0,0,0,0,0,0,1,1,5,6,7,9,9,12,14,28,45,64,71,94,111,135,145,183,183,224,247,281,308,321,334,344,349,358,358,362,382,388,389,391,391,391,394,402,407,408,408,410,410,412,412,417,417,418,418,420,420,422,423,423,424,424,425,427,426,431,436,436,437,439,440,441,443,443,446,446,447,449,449,452,452,456,459,460,465,470,471,471,473,477,478,479,480,480,480,481,481,486,487,488,489,495,496,495,497,502,504,505,506,507,507,508,516,517,520,521,522,526,528,531,533,536,547,550,551,563,566,571]
[null,"Saint Barthelemy","France","2020-09-17",-628333,0,0,0,0,0,0,0,0,0,0,0,0,0,0,0,0,0,0,0,0,0,0,0,0,0,0,0,0,0,0,0,0,0,0,0,0,0,0,0,0,0,0,3,3,3,3,3,1,1,1,1,1,1,1,3,3,3,3,3,3,3,3,3,3,3,5,5,5,6,6,6,6,6,6,6,6,6,6,6,6,6,6,6,6,6,6,6,6,6,6,6,6,6,6,6,6,6,6,6,6,6,6,6,6,6,6,6,6,6,6,6,6,6,6,6,6,6,6,6,6,6,6,6,6,6,6,6,6,6,6,6,6,6,6,6,6,6,6,6,6,6,6,6,6,6,6,6,6,6,6,6,6,6,6,6,6,6,6,6,6,6,6,6,6,6,6,6,6,6,6,6]
[null,"St Martin","France",180708,-630501,0,0,0,0,0,0,0,0,0,0,0,0,0,0,0,0,0,0,0,0,0,0,0,0,0,0,0,0,0,0,0,0,0,0,0,0,0,0,0,0,0,0,0,0,0,0,0,2,2,2,2,2,2,2,2,2,3,4,4,4,5,8,8,11,11,11,11,11,15,15,15,22,22,24,32,32,32,32,32,32,32,32,32,32,35,35,35,37,37,37,37,38,38,38,38,38,38,38,38,38,38,38,38,38,38,38,38,38,39,39,39,39,39,39,39,39,39,39,39,40,40,40,40,40,40,40,40,40,40,41,41,41,41,41,41,41,41,41,41,41,41,41,42,42,42,42,42,42,42,42,42,42,42,42,42,42,42,42,43,43,43,43,43,43,43,43,43,43,43,43,43]
[null,"Martinique","France",146415,-610242,0,0,0,0,0,0,0,0,0,0,0,0,0,0,0,0,0,0,0,0,0,0,0,0,0,0,0,0,0,0,0,0,0,0,0,0,0,0,0,0,0,0,0,0,0,2,2,2,2,3,3,3,9,9,15,16,19,23,32,32,44,53,57,66,66,81,93,93,93,128,135,138,143,145,149,151,152,154,154,155,155,155,157,157,158,158,158,158,163,163,163,164,164,170,175,175,175,175,175,178,179,179,179,181,181,182,183,186,186,186,187,187,189,189,192,192,192,192,192,192,192,197,197,197,197,197,197,197,200,200,200,200,200,200,200,202,202,202,202,202,202,202,202,202,202,202,202,202,221,236,236,236,236,236,236,236,242,242,242,242,242,242,242,249,249,249,249,249,249,249,255]
[null,null,"France",462276,22137,0,0,2,3,3,3,4,5,5,5,6,6,6,6,6,6,6,11,11,11,11,11,11,11,12,12,12,12,12,12,12,12,12,12,14,18,38,57,100,130,191,204,285,377,653,949,1126,1209,1784,2281,2281,3661,4469,4499,6633,7652,9043,10871,12612,14282,16018,19856,22304,25233,29155,32964,37575,40174,44550,52128,56989,59105,64338,68605,70478,74390,78167,82048,86334,90676,93790,120633,124298,129257,132473,144944,146923,146906,151808,154188,156921,154715,157026,158636,160292,160847,164589,167605,165093,165764,165764,166976,167272,167886,168935,172465,173040,174318,174758,175027,175479,176207,175981,176712,177319,177207,177240,177554,178428,179069,179306,179645,179964,179859,180166,179887,180044,183309,183816,185616,185851,185952,185112,185440,186118,186670,187199,187492,187590,187925,188322,188680,189244,189637,189928,189996,190223,190534,190735,191304,191740,191745,192070,192452,192265,192010,193346,193152,192429,194109,194373,194985,195458,195904,195546,195535,196748,197089,196796,197964,198450]
[null,null,"Gabon","-0.8037",116094,0,0,0,0,0,0,0,0,0,0,0,0,0,0,0,0,0,0,0,0,0,0,0,0,0,0,0,0,0,0,0,0,0,0,0,0,0,0,0,0,0,0,0,0,0,0,0,0,0,0,0,0,1,1,1,1,1,1,3,4,5,5,6,6,7,7,7,7,7,16,18,21,21,21,21,24,30,34,44,44,46,49,57,57,80,80,108,108,109,120,156,166,167,172,176,176,211,238,276,276,276,335,335,367,397,397,504,620,661,661,802,863,1004,1104,1209,1320,1320,1432,1502,1567,1567,1728,1934,1934,2135,2238,2319,2431,2613,2655,2655,2655,2803,2902,2955,3101,3101,3101,3101,3247,3375,3463,3463,3463,3463,4033,4114,4229,4340,4428,4428,4428,4739,4849,4956,5087,5209,5209,5209,5394,5394,5513,5513,5620,5620,5620,5743,5743,5871,5871,5942]
[null,null,"Gambia",134432,-153101,0,0,0,0,0,0,0,0,0,0,0,0,0,0,0,0,0,0,0,0,0,0,0,0,0,0,0,0,0,0,0,0,0,0,0,0,0,0,0,0,0,0,0,0,0,0,0,0,0,0,0,0,0,0,0,1,1,1,1,1,1,2,3,3,3,3,3,4,4,4,4,4,4,4,4,4,4,4,4,4,9,9,9,9,9,9,9,9,10,10,10,10,10,10,10,10,10,10,10,11,12,17,17,17,17,17,18,20,20,20,22,22,23,23,23,23,23,24,24,24,24,25,25,25,25,25,25,25,25,25,25,25,25,26,26,26,26,26,28,28,28,28,28,28,28,30,34,34,36,36,37,37,41,42,42,43,43,44,45,47,49,49,55,55,57,57,61,61,61,63,64]
[null,null,"Georgia",423154,433569,0,0,0,0,0,0,0,0,0,0,0,0,0,0,0,0,0,0,0,0,0,0,0,0,0,0,0,0,0,0,0,0,0,0,0,1,1,1,1,3,3,3,3,4,4,4,13,15,15,24,24,25,30,33,33,34,38,40,43,49,54,61,70,75,79,83,90,91,103,110,117,134,155,162,174,188,196,211,218,234,242,257,272,300,306,348,370,388,394,402,408,416,425,444,456,486,497,511,517,539,566,582,589,593,604,610,615,623,626,635,638,642,647,667,671,683,695,701,707,713,721,723,728,730,731,732,735,738,746,757,783,794,796,800,801,805,808,809,812,818,827,831,843,851,864,879,879,888,893,896,898,906,908,911,914,917,919,921,924,926,928,931,939,943,948,951,953,958,963,968,973]
[null,null,"Germany","51.0","9.0",0,0,0,0,0,1,4,4,4,5,8,10,12,12,12,12,13,13,14,14,16,16,16,16,16,16,16,16,16,16,16,16,16,16,17,27,46,48,79,130,159,196,262,482,670,799,1040,1176,1457,1908,2078,3675,4585,5795,7272,9257,12327,15320,19848,22213,24873,29056,32986,37323,43938,50871,57695,62095,66885,71808,77872,84794,91159,96092,100123,103374,107663,113296,118181,122171,124908,127854,130072,131359,134753,137698,141397,143342,145184,147065,148291,150648,153129,154999,156513,157770,158758,159912,161539,163009,164077,164967,165664,166152,167007,168162,169430,170588,171324,171879,172576,173171,174098,174478,175233,175752,176369,176551,177778,178473,179021,179710,179986,180328,180600,181200,181524,182196,182922,183189,183410,183594,183879,184121,184472,184924,185450,185750,186109,186506,186522,186691,187226,187267,187518,187682,188252,188604,189817,190299,190670,191272,191768,192480,192871,193371,194036,194458,194693,195042,195418,195893,196370,196780,197198,197523,198064,198343,198699,199001,199332]
[null,null,"Ghana",79465,-10232,0,0,0,0,0,0,0,0,0,0,0,0,0,0,0,0,0,0,0,0,0,0,0,0,0,0,0,0,0,0,0,0,0,0,0,0,0,0,0,0,0,0,0,0,0,0,0,0,0,0,0,0,3,6,6,7,7,11,16,19,23,27,53,93,132,137,141,152,152,161,195,204,205,205,214,214,287,313,378,378,408,566,566,636,636,641,641,834,1042,1042,1042,1154,1154,1279,1279,1550,1550,1671,1671,2074,2074,2169,2169,2719,2719,3091,3091,4012,4263,4263,4700,5127,5408,5530,5638,5735,5735,5735,6096,6269,6269,6486,6617,6683,6808,7117,7303,7303,7616,7768,8070,8070,8297,8548,8885,9168,9462,9638,9910,10201,10201,10358,10856,11118,11964,11964,12193,12590,12929,13203,13717,14154,14154,14568,15013,15473,15834,16431,16742,17351,17741,18134,18134,19388,19388,20085,21077,21968,22822,23463,23834]
[null,null,"Greece",390742,218243,0,0,0,0,0,0,0,0,0,0,0,0,0,0,0,0,0,0,0,0,0,0,0,0,0,0,0,0,0,0,0,0,0,0,0,1,3,4,4,7,7,7,9,31,45,46,73,73,89,99,99,190,228,331,331,387,418,418,495,530,624,695,743,821,892,966,1061,1156,1212,1314,1415,1544,1613,1673,1735,1755,1832,1884,1955,2011,2081,2114,2145,2170,2192,2207,2224,2235,2235,2245,2401,2408,2463,2490,2506,2517,2534,2566,2576,2591,2612,2620,2626,2632,2642,2663,2678,2691,2710,2716,2726,2744,2760,2770,2810,2819,2834,2836,2840,2850,2853,2874,2876,2878,2882,2892,2903,2906,2909,2915,2917,2918,2937,2937,2952,2967,2980,2997,3049,3058,3068,3088,3108,3112,3121,3134,3148,3203,3227,3237,3256,3266,3287,3302,3310,3321,3343,3366,3376,3390,3409,3432,3458,3486,3511,3519,3562,3589,3622,3672,3732]
[null,null,"Guatemala",157835,-902308,0,0,0,0,0,0,0,0,0,0,0,0,0,0,0,0,0,0,0,0,0,0,0,0,0,0,0,0,0,0,0,0,0,0,0,0,0,0,0,0,0,0,0,0,0,0,0,0,0,0,0,0,1,1,2,6,6,9,12,17,19,20,21,24,25,28,34,34,36,38,39,47,50,61,61,70,77,87,95,126,137,155,156,167,180,196,214,235,257,289,294,316,384,430,473,500,530,530,557,599,644,688,703,730,763,798,832,900,967,1052,1114,1199,1342,1518,1643,1763,1763,1912,2133,2265,2512,2743,3054,3424,3760,3954,4145,4348,4607,4739,5087,5336,5586,5760,6154,6485,6792,7055,7502,7866,8221,8561,8982,9491,9845,10272,10706,11251,11868,12509,12755,13145,13769,14540,14819,15619,15828,16397,16930,17409,18096,19011,20072,21293,22501,23248,23972,24787,25411,26658,27619]
[null,null,"Guinea",99456,-96966,0,0,0,0,0,0,0,0,0,0,0,0,0,0,0,0,0,0,0,0,0,0,0,0,0,0,0,0,0,0,0,0,0,0,0,0,0,0,0,0,0,0,0,0,0,0,0,0,0,0,0,1,1,1,1,1,1,1,1,2,2,4,4,4,4,8,8,16,22,22,30,52,73,111,121,128,144,164,194,212,250,250,319,363,404,438,477,518,579,622,688,761,862,954,996,996,1163,1240,1351,1495,1537,1586,1586,1710,1811,1856,1927,2009,2042,2146,2146,2298,2374,2473,2473,2658,2658,2796,2863,2863,3067,3067,3176,3275,3275,3275,3275,3553,3656,3706,3706,3844,3886,3933,3991,4060,4117,4117,4216,4258,4258,4372,4426,4484,4532,4572,4639,4668,4841,4904,4960,4988,4988,5040,5174,5174,5260,5291,5342,5351,5391,5404,5450,5521,5570,5610,5610,5636,5697,5881,5969]
[null,null,"Guyana","5.0","-58.75",0,0,0,0,0,0,0,0,0,0,0,0,0,0,0,0,0,0,0,0,0,0,0,0,0,0,0,0,0,0,0,0,0,0,0,0,0,0,0,0,0,0,0,0,0,0,0,0,0,0,1,1,1,4,4,7,7,7,7,7,19,20,5,5,5,5,8,8,8,12,19,19,23,23,24,31,33,37,37,37,45,45,45,47,55,55,63,63,65,65,66,67,70,73,73,74,74,74,78,82,82,82,82,92,93,93,93,94,94,104,109,113,113,113,116,117,117,124,125,125,127,127,127,135,137,139,139,150,150,152,153,153,153,153,153,153,154,154,154,156,156,158,159,159,159,159,171,171,183,183,183,184,205,206,209,215,215,230,230,235,245,248,250,256,272,273,273,284,284,286,290]
[null,null,"Haiti",189712,-722852,0,0,0,0,0,0,0,0,0,0,0,0,0,0,0,0,0,0,0,0,0,0,0,0,0,0,0,0,0,0,0,0,0,0,0,0,0,0,0,0,0,0,0,0,0,0,0,0,0,0,0,0,0,0,0,0,0,0,2,2,2,6,7,8,8,8,8,15,15,15,16,16,18,20,21,24,25,27,30,31,33,33,40,40,41,41,43,44,47,57,57,62,72,72,72,74,76,76,76,81,85,85,88,100,101,101,129,146,151,182,209,209,234,273,310,358,456,533,533,596,734,812,865,865,958,1174,1320,1320,1584,1865,2124,2226,2226,2507,2640,2740,3072,3334,3538,3662,3796,3941,3941,4165,4165,4441,4547,4688,4916,4980,5077,5077,5211,5324,5429,5543,5722,5777,5777,5933,5975,6040,6101,6230,6294,6333,6371,6432,6486,6486,6617]
[null,null,"Holy See",419029,124534,0,0,0,0,0,0,0,0,0,0,0,0,0,0,0,0,0,0,0,0,0,0,0,0,0,0,0,0,0,0,0,0,0,0,0,0,0,0,0,0,0,0,0,0,1,1,1,1,1,1,1,1,1,1,1,1,1,1,1,1,1,1,4,4,4,4,6,6,6,6,6,7,7,7,7,7,7,8,8,8,8,8,8,8,8,8,8,8,8,9,9,9,9,9,9,9,9,10,10,11,11,11,11,11,11,12,12,12,12,12,12,12,12,12,12,12,12,12,12,12,12,12,12,12,12,12,12,12,12,12,12,12,12,12,12,12,12,12,12,12,12,12,12,12,12,12,12,12,12,12,12,12,12,12,12,12,12,12,12,12,12,12,12,12,12,12,12,12,12,12,12]
[null,null,"Honduras","2020-02-15",-862419,0,0,0,0,0,0,0,0,0,0,0,0,0,0,0,0,0,0,0,0,0,0,0,0,0,0,0,0,0,0,0,0,0,0,0,0,0,0,0,0,0,0,0,0,0,0,0,0,0,2,2,2,2,3,6,8,9,12,24,24,26,30,30,36,52,68,95,110,139,141,172,219,222,264,268,298,305,312,343,382,392,393,397,407,419,426,442,457,472,477,494,510,519,591,627,627,661,702,738,771,804,1010,1055,1178,1270,1461,1685,1771,1830,1972,2100,2080,2255,2318,2460,2565,2646,2798,2955,2955,3204,3477,3477,3950,4189,4401,4640,4752,4752,5094,5202,5362,5527,5690,5880,5971,6155,6327,6450,6935,7360,7669,8132,8455,8858,9178,9656,10299,10739,11258,12306,12769,13356,13943,14571,15366,15994,17007,18082,18818,19558,20262,21120,22116,22921,23943,24665,25428,25978,26384,27053]
[null,null,"Hungary",471625,195033,0,0,0,0,0,0,0,0,0,0,0,0,0,0,0,0,0,0,0,0,0,0,0,0,0,0,0,0,0,0,0,0,0,0,0,0,0,0,0,0,0,0,2,2,2,4,7,9,9,13,13,19,30,32,39,50,58,73,85,103,131,167,187,226,261,300,343,408,447,492,525,585,623,678,733,744,817,895,980,1190,1310,1410,1458,1512,1579,1652,1763,1834,1916,1984,2098,2168,2284,2443,2443,2500,2583,2649,2727,2775,2863,2942,2998,3035,3065,3111,3150,3178,3213,3263,3284,3313,3341,3380,3417,3473,3509,3535,3556,3598,3641,3678,3713,3741,3756,3771,3793,3816,3841,3867,3876,3892,3921,3931,3954,3970,3990,4008,4014,4017,4027,4039,4053,4064,4069,4076,4077,4078,4079,4081,4086,4094,4102,4107,4114,4123,4127,4138,4142,4145,4155,4157,4166,4172,4174,4183,4189,4205,4210,4220,4223]
[null,null,"Iceland",649631,-190208,0,0,0,0,0,0,0,0,0,0,0,0,0,0,0,0,0,0,0,0,0,0,0,0,0,0,0,0,0,0,0,0,0,0,0,0,0,1,1,3,6,11,26,34,43,50,50,58,69,85,103,134,156,171,180,220,250,330,409,473,568,588,648,737,802,890,963,1020,1086,1135,1220,1319,1364,1417,1486,1562,1586,1616,1648,1675,1689,1701,1711,1720,1727,1739,1754,1760,1771,1773,1778,1785,1789,1789,1790,1792,1792,1795,1797,1797,1798,1798,1799,1799,1799,1799,1801,1801,1801,1801,1801,1801,1802,1802,1802,1802,1802,1802,1802,1803,1803,1803,1804,1804,1804,1804,1805,1805,1805,1806,1806,1806,1806,1806,1806,1806,1806,1807,1807,1807,1807,1807,1807,1808,1810,1810,1812,1815,1816,1819,1822,1823,1823,1824,1824,1830,1832,1836,1838,1840,1842,1847,1850,1855,1860,1863,1866,1873,1880,1882,1886]
[null,null,"India","21.0","78.0",0,0,0,0,0,0,0,0,1,1,1,2,3,3,3,3,3,3,3,3,3,3,3,3,3,3,3,3,3,3,3,3,3,3,3,3,3,3,3,3,5,5,28,30,31,34,39,43,56,62,73,82,102,113,119,142,156,194,244,330,396,499,536,657,727,887,987,1024,1251,1397,1998,2543,2567,3082,3588,4778,5311,5916,6725,7598,8446,9205,10453,11487,12322,13430,14352,15722,17615,18539,20080,21370,23077,24530,26283,27890,29451,31324,33062,34863,37257,39699,42505,46437,49400,52987,56351,59695,62808,67161,70768,74292,78055,81997,85784,90648,95698,100328,106475,112028,118226,124794,131423,138536,144950,150793,158086,165386,173491,181827,190609,198370,207191,216824,226713,236184,246622,257486,265928,276146,286605,297535,308993,320922,332424,343091,354065,366946,380532,395048,410451,425282,440215,456183,473105,490401,508953,528859,548318,566840,585481,604641,625544,648315,673165,697413,719664,742417,767296,793802,820916]
[null,null,"Indonesia","-0.7893",1139213,0,0,0,0,0,0,0,0,0,0,0,0,0,0,0,0,0,0,0,0,0,0,0,0,0,0,0,0,0,0,0,0,0,0,0,0,0,0,0,0,2,2,2,2,4,4,6,19,27,34,34,69,96,117,134,172,227,311,369,450,514,579,686,790,893,1046,1155,1285,1414,1528,1677,1790,1986,2092,2273,2491,2738,2956,3293,3512,3842,4241,4557,4839,5136,5516,5923,6248,6575,6760,7135,7418,7775,8211,8607,8882,9096,9511,9771,10118,10551,10843,11192,11587,12071,12438,12776,13112,13645,14032,14265,14749,15438,16006,16496,17025,17514,18010,18496,19189,20162,20796,21745,22271,22750,23165,23851,24538,25216,25773,26473,26940,27549,28233,28818,29521,30514,31186,32033,33076,34316,35295,36406,37420,38277,39294,40400,41431,42762,43803,45029,45891,46845,47896,49009,50187,51427,52812,54010,55092,56385,57770,59394,60695,62142,63749,64958,66226,68079,70736,72347]
[null,null,"Iran","32.0","53.0",0,0,0,0,0,0,0,0,0,0,0,0,0,0,0,0,0,0,0,0,0,0,0,0,0,0,0,0,2,5,18,28,43,61,95,139,245,388,593,978,1501,2336,2922,3513,4747,5823,6566,7161,8042,9000,10075,11364,12729,13938,14991,16169,17361,18407,19644,20610,21638,23049,24811,27017,29406,32332,35408,38309,41495,44605,47593,50468,53183,55743,58226,60500,62589,64586,66220,68192,70029,71686,73303,74877,76389,77995,79494,80868,82211,83505,84802,85996,87026,88194,89328,90481,91472,92584,93657,94640,95646,96448,97424,98647,99970,101650,103135,104691,106220,107603,109286,110767,112725,114533,116635,118392,120198,122492,124603,126949,129341,131652,133521,135701,137724,139511,141591,143849,146668,148950,151466,154445,157562,160696,164270,167156,169425,171789,173832,175927,177938,180156,182525,184955,187427,189876,192439,195051,197647,200262,202584,204952,207525,209970,212501,215096,217724,220180,222669,225205,227662,230211,232863,235429,237878,240438,243051,245688,248379,250458,252720]
[null,null,"Iraq","33.0","44.0",0,0,0,0,0,0,0,0,0,0,0,0,0,0,0,0,0,0,0,0,0,0,0,0,0,0,0,0,0,0,0,0,0,1,1,5,7,7,13,19,26,32,35,35,40,54,60,60,71,71,71,101,110,116,124,154,164,192,208,214,233,266,316,346,382,458,506,547,630,694,728,772,820,878,961,1031,1122,1202,1232,1279,1318,1352,1378,1400,1415,1434,1482,1513,1539,1574,1602,1631,1677,1708,1763,1820,1847,1928,2003,2085,2153,2219,2296,2346,2431,2480,2543,2603,2679,2767,2818,2913,3032,3143,3193,3260,3404,3554,3611,3724,3877,3964,4272,4469,4632,4848,5135,5457,5873,6179,6439,6868,7387,8168,8840,9846,11098,12366,13481,14268,15414,16675,17770,18950,20209,21315,22700,24254,25717,27352,29222,30868,32676,34502,36702,39139,41193,43262,45402,47151,49109,51524,53708,56020,58354,60479,62275,64701,67442,69612,72460]
[null,null,"Ireland",531424,-76921,0,0,0,0,0,0,0,0,0,0,0,0,0,0,0,0,0,0,0,0,0,0,0,0,0,0,0,0,0,0,0,0,0,0,0,0,0,0,1,1,1,2,6,6,18,18,19,21,34,43,43,90,129,129,169,223,292,557,683,785,906,1125,1329,1564,1819,2121,2415,2615,2910,3235,3447,3849,4273,4604,4994,5364,5709,6074,6574,8089,8928,9655,10647,11479,12547,13271,13980,14758,15251,15652,16040,16671,17607,18184,18561,19262,19648,19877,20253,20612,20833,21176,21506,21772,21983,22248,22385,22541,22760,22996,23135,23242,23401,23827,23956,24048,24112,24200,24251,24315,24391,24506,24582,24639,24698,24735,24803,24841,24876,24929,24990,25062,25066,25111,25142,25163,25183,25201,25207,25215,25231,25238,25250,25295,25303,25321,25334,25341,25355,25368,25374,25379,25383,25391,25396,25405,25414,25437,25439,25462,25473,25477,25489,25498,25509,25527,25531,25538,25542,25565,25589]
[null,null,"Israel","31.0","35.0",0,0,0,0,0,0,0,0,0,0,0,0,0,0,0,0,0,0,0,0,0,0,0,0,0,0,0,0,0,0,1,1,1,1,1,2,3,4,7,10,10,12,15,20,37,43,61,61,75,79,100,126,155,213,218,250,304,427,529,712,883,1071,1238,2369,2693,3035,3619,4247,4695,5358,6092,6857,7428,7851,8430,8904,9248,9404,9968,10408,10743,11145,11586,12046,12501,12758,12982,13265,13491,13713,13942,14498,14803,15058,15298,15443,15555,15728,15834,15946,16101,16185,16208,16246,16289,16310,16381,16436,16454,16477,16506,16529,16548,16579,16589,16608,16617,16643,16659,16667,16683,16690,16712,16717,16734,16757,16793,16872,16987,17012,17071,17169,17285,17377,17495,17562,17752,17863,18032,18180,18355,18569,18795,18972,19055,19237,19495,19783,20036,20339,20633,20778,21082,21512,22044,22400,22800,23421,23755,24441,25244,26257,27047,28055,29170,29958,30749,32222,33557,34825,36266]
[null,null,"Italy","43.0","12.0",0,0,0,0,0,0,0,0,0,2,2,2,2,2,2,2,3,3,3,3,3,3,3,3,3,3,3,3,3,3,20,62,155,229,322,453,655,888,1128,1694,2036,2502,3089,3858,4636,5883,7375,9172,10149,12462,15113,17660,21157,24747,27980,31506,35713,41035,47021,53578,59138,63927,69176,74386,80589,86498,92472,97689,101739,105792,110574,115242,119827,124632,128948,132547,135586,139422,143626,147577,152271,156363,159516,162488,165155,168941,172434,175925,178972,181228,183957,187327,189973,192994,195351,197675,199414,201505,203591,205463,207428,209328,210717,211938,213013,214457,215858,217185,218268,219070,219814,221216,222104,223096,223885,224760,225435,225886,226699,227364,228006,228658,229327,229858,230158,230555,231139,231732,232248,232664,232997,233197,233515,233836,234013,234531,234801,234998,235278,235561,235763,236142,236305,236651,236989,237290,237500,237828,238159,238011,238275,238499,238720,238833,239410,239706,239961,240136,240310,240436,240578,240760,240961,241184,241419,241611,241819,241956,242149,242363,242639]
[null,null,"Jamaica",181096,-772975,0,0,0,0,0,0,0,0,0,0,0,0,0,0,0,0,0,0,0,0,0,0,0,0,0,0,0,0,0,0,0,0,0,0,0,0,0,0,0,0,0,0,0,0,0,0,0,0,0,1,2,8,8,10,10,12,13,15,16,16,19,19,21,26,26,26,30,32,36,36,44,47,47,53,58,58,63,63,63,63,65,69,73,73,125,143,143,163,173,223,223,233,257,288,305,350,364,364,396,422,432,463,469,471,473,478,488,490,490,502,505,507,509,509,511,517,520,520,520,529,534,544,550,552,556,564,569,569,575,581,586,588,590,591,591,595,596,598,599,605,605,611,614,615,617,621,621,626,638,652,657,659,665,670,678,684,686,690,696,698,702,707,715,721,728,732,737,745,751,753,753]
[null,null,"Japan","36.0","138.0",2,2,2,2,4,4,7,7,11,15,20,20,20,22,23,23,23,24,24,26,27,28,33,43,54,60,67,79,85,95,112,137,149,160,173,192,218,236,245,259,278,298,333,365,420,466,499,527,585,640,696,733,795,826,843,893,928,968,1022,1059,1104,1144,1217,1314,1416,1530,1728,1907,2001,2255,2535,2818,3154,3525,3876,4110,4485,5020,5614,6250,6951,7473,7773,8277,8835,9398,9958,10548,10914,11258,11641,12037,12469,12854,13186,13405,13576,13860,14076,14284,14558,14861,15061,15229,15354,15455,15553,15640,15755,15824,15861,15948,15998,16096,16148,16202,16226,16259,16287,16321,16362,16385,16410,16451,16472,16502,16528,16598,16673,16716,16751,16787,16837,16867,16911,16958,17000,17039,17060,17111,17146,17187,17250,17293,17369,17439,17484,17530,17588,17658,17725,17780,17820,17879,17963,18055,18162,18254,18366,18476,18615,18838,19055,19185,19461,19668,19848,20055,20261,20617,21044]
[null,null,"Jordan","31.24","36.51",0,0,0,0,0,0,0,0,0,0,0,0,0,0,0,0,0,0,0,0,0,0,0,0,0,0,0,0,0,0,0,0,0,0,0,0,0,0,0,0,0,1,1,1,1,1,1,1,1,1,1,1,1,8,17,34,52,69,85,85,112,127,154,172,212,235,246,259,268,274,278,299,310,323,345,349,353,358,372,372,381,389,391,397,401,402,407,413,417,425,428,435,437,441,444,447,449,449,451,453,459,460,461,465,471,473,494,508,522,540,562,576,582,586,596,607,613,629,649,672,684,700,704,708,711,718,720,728,730,734,739,746,755,757,765,784,795,808,831,845,863,890,915,953,961,979,981,987,1001,1008,1015,1033,1042,1047,1071,1086,1104,1111,1121,1128,1132,1133,1136,1147,1150,1164,1167,1169,1169,1169,1173]
[null,null,"Kazakhstan",480196,669237,0,0,0,0,0,0,0,0,0,0,0,0,0,0,0,0,0,0,0,0,0,0,0,0,0,0,0,0,0,0,0,0,0,0,0,0,0,0,0,0,0,0,0,0,0,0,0,0,0,0,0,4,6,9,10,33,35,44,49,53,60,62,72,81,111,150,228,284,302,343,380,435,464,531,584,662,697,727,781,812,865,951,1091,1232,1295,1402,1546,1615,1676,1852,1995,2135,2289,2482,2601,2717,2835,3027,3138,3402,3597,3857,3920,4049,4205,4422,4578,4834,4975,5090,5207,5279,5417,5571,5689,5850,6157,6751,6751,6969,7234,7919,7919,8531,8969,8969,9304,9576,9932,10382,10858,11308,11571,12067,12067,12312,12511,12694,12859,13074,13319,13872,13872,14238,14496,15192,15542,15877,15877,16779,17225,17732,18231,18765,19285,19750,20319,20319,21327,21819,22308,41065,42574,45719,47171,48574,49683,51059,51059,54747,56455]
[null,null,"Kenya","-0.0236",379062,0,0,0,0,0,0,0,0,0,0,0,0,0,0,0,0,0,0,0,0,0,0,0,0,0,0,0,0,0,0,0,0,0,0,0,0,0,0,0,0,0,0,0,0,0,0,0,0,0,0,0,1,1,3,3,3,3,7,7,7,15,16,25,28,31,31,38,42,50,59,81,110,122,126,142,158,172,179,184,189,191,197,208,216,225,234,246,262,270,281,296,303,320,336,343,355,363,374,384,396,411,435,465,490,535,582,607,621,649,672,700,715,737,758,781,830,887,912,963,1029,1109,1161,1192,1214,1286,1348,1471,1618,1745,1888,1962,2021,2093,2216,2340,2474,2600,2767,2872,2989,3094,3215,3305,3457,3594,3727,3860,4044,4257,4374,4478,4738,4797,4952,5206,5384,5533,5811,6070,6190,6366,6673,6941,7188,7577,7886,8067,8250,8528,8975,9448]
[null,null,"Korea, South","36.0","128.0",1,1,2,2,3,4,4,4,4,11,12,15,15,16,19,23,24,24,25,27,28,28,28,28,28,29,30,31,31,104,204,433,602,833,977,1261,1766,2337,3150,3736,4335,5186,5621,6088,6593,7041,7314,7478,7513,7755,7869,7979,8086,8162,8236,8320,8413,8565,8652,8799,8961,8961,9037,9137,9241,9332,9478,9583,9661,9786,9887,9976,10062,10156,10237,10284,10331,10384,10423,10450,10480,10512,10537,10564,10591,10613,10635,10653,10661,10674,10683,10694,10708,10718,10728,10738,10752,10761,10765,10774,10780,10793,10801,10804,10806,10810,10822,10840,10874,10909,10936,10962,10991,11018,11037,11050,11065,11078,11110,11122,11142,11165,11190,11206,11225,11265,11344,11402,11441,11468,11503,11541,11590,11629,11668,11719,11776,11814,11852,11902,11947,12003,12051,12085,12121,12155,12198,12257,12306,12373,12421,12438,12484,12535,12563,12602,12653,12715,12757,12800,12850,12904,12967,13030,13091,13137,13181,13244,13293,13338,13373]
[null,null,"Kuwait","2020-05-29","47.75",0,0,0,0,0,0,0,0,0,0,0,0,0,0,0,0,0,0,0,0,0,0,0,0,0,0,0,0,0,0,0,0,0,1,11,26,43,45,45,45,56,56,56,58,58,61,64,64,69,72,80,80,104,112,123,130,142,148,159,176,188,189,191,195,208,225,235,255,266,289,317,342,417,479,556,665,743,855,910,993,1154,1234,1300,1355,1405,1524,1658,1751,1915,1995,2080,2248,2399,2614,2892,3075,3288,3440,3740,4024,4377,4619,4983,5278,5804,6289,6567,7208,7623,8688,9286,10277,11028,11975,12860,13802,14850,15691,16764,17568,18609,19564,20464,21302,21967,22575,23267,24112,25184,26192,27043,27762,28649,29359,29921,30644,31131,31848,32510,33140,33823,34432,34952,35466,35920,36431,36958,37533,38074,38678,39145,39650,40291,41033,41879,42788,43703,44391,44942,45524,46195,46940,47859,48672,49303,49941,50644,51245,52007,52840,53580]
[null,null,"Kyrgyzstan",412044,747661,0,0,0,0,0,0,0,0,0,0,0,0,0,0,0,0,0,0,0,0,0,0,0,0,0,0,0,0,0,0,0,0,0,0,0,0,0,0,0,0,0,0,0,0,0,0,0,0,0,0,0,0,0,0,0,0,3,3,6,14,14,16,42,44,44,58,58,84,94,107,111,116,130,144,147,216,228,270,280,298,339,377,419,430,449,466,489,506,554,568,590,612,631,665,665,682,695,708,729,746,756,769,795,830,843,871,895,906,931,1002,1016,1037,1044,1082,1111,1117,1138,1216,1243,1270,1313,1350,1365,1403,1433,1468,1520,1594,1662,1722,1748,1817,1845,1871,1899,1936,1974,2007,2032,2055,2093,2166,2166,2207,2285,2472,2562,2657,2657,2789,2981,3356,3356,3726,3954,4204,4446,4513,5017,5296,5506,6261,6767,6878,7094,7377,8141,8279,8847,9358,9910]
[null,null,"Latvia",568796,246032,0,0,0,0,0,0,0,0,0,0,0,0,0,0,0,0,0,0,0,0,0,0,0,0,0,0,0,0,0,0,0,0,0,0,0,0,0,0,0,0,1,1,1,1,1,1,2,6,8,10,10,17,26,30,34,49,71,86,111,124,139,180,197,221,244,280,305,347,376,398,446,458,493,509,533,542,548,577,589,612,630,651,655,657,666,675,682,712,727,739,748,761,778,784,804,812,818,836,849,858,870,871,879,896,896,900,909,928,930,939,946,950,951,962,970,997,1008,1009,1012,1016,1025,1030,1046,1047,1049,1053,1057,1061,1064,1065,1066,1066,1071,1079,1082,1085,1086,1088,1088,1089,1092,1094,1096,1097,1097,1097,1098,1104,1108,1110,1111,1111,1111,1111,1111,1111,1112,1115,1116,1117,1118,1121,1122,1122,1123,1124,1127,1134,1141,1154,1165]
[null,null,"Lebanon",338547,358623,0,0,0,0,0,0,0,0,0,0,0,0,0,0,0,0,0,0,0,0,0,0,0,0,0,0,0,0,0,0,1,1,1,1,1,2,2,2,4,10,13,13,13,16,22,22,32,32,41,61,61,77,93,110,110,120,133,157,163,187,248,267,318,333,368,391,412,438,446,470,479,494,508,520,527,541,548,576,582,609,619,630,632,641,658,663,668,672,673,677,677,682,688,696,704,707,710,717,721,725,729,733,737,740,741,750,784,796,809,845,859,870,878,886,891,902,911,931,954,961,1024,1086,1097,1114,1119,1140,1161,1168,1172,1191,1220,1233,1242,1256,1306,1312,1320,1331,1350,1368,1388,1402,1422,1442,1446,1464,1473,1489,1495,1510,1536,1587,1603,1622,1644,1662,1697,1719,1740,1745,1778,1788,1796,1830,1855,1873,1885,1907,1946,2011,2082]
[null,null,"Liberia",64281,-94295,0,0,0,0,0,0,0,0,0,0,0,0,0,0,0,0,0,0,0,0,0,0,0,0,0,0,0,0,0,0,0,0,0,0,0,0,0,0,0,0,0,0,0,0,0,0,0,0,0,0,0,0,0,0,1,1,2,2,2,3,3,3,3,3,3,3,3,3,3,3,6,6,7,10,13,14,14,31,31,37,48,50,59,59,59,59,76,76,91,99,101,101,101,117,120,124,124,141,141,141,152,154,158,166,170,178,189,199,199,199,211,211,213,215,219,223,226,229,233,238,240,249,255,265,265,266,266,269,273,280,288,296,311,316,321,334,345,359,370,383,397,410,421,446,458,498,509,516,542,581,601,626,650,652,662,681,684,729,768,770,780,804,819,833,869,874,891,917,926,957,963]
[null,null,"Liechtenstein","47.14","1955-09-01",0,0,0,0,0,0,0,0,0,0,0,0,0,0,0,0,0,0,0,0,0,0,0,0,0,0,0,0,0,0,0,0,0,0,0,0,0,0,0,0,0,0,1,1,1,1,1,1,1,1,1,1,4,4,4,7,28,28,28,37,37,51,51,51,56,56,56,56,62,68,68,75,75,77,77,77,78,78,78,79,79,79,79,79,79,79,79,79,81,81,81,81,81,81,81,82,82,82,82,82,82,82,82,82,82,82,82,82,82,82,82,82,82,82,82,82,82,82,82,82,82,82,82,82,82,82,82,82,82,82,82,82,82,82,82,82,82,82,82,82,82,82,82,82,82,82,82,82,82,82,82,82,83,86,82,82,82,82,82,82,82,82,83,83,83,83,84,84,84,84,84]
[null,null,"Lithuania",551694,238813,0,0,0,0,0,0,0,0,0,0,0,0,0,0,0,0,0,0,0,0,0,0,0,0,0,0,0,0,0,0,0,0,0,0,0,0,0,1,1,1,1,1,1,1,1,1,1,1,1,3,3,6,8,12,17,25,27,36,49,83,143,179,209,274,299,358,394,460,491,537,581,649,696,771,811,843,880,912,955,999,1026,1053,1062,1070,1091,1128,1149,1239,1298,1326,1350,1370,1398,1410,1426,1438,1449,1344,1375,1385,1399,1406,1410,1419,1423,1428,1433,1436,1444,1479,1485,1491,1505,1511,1523,1534,1541,1547,1562,1577,1593,1604,1616,1623,1635,1639,1647,1656,1662,1670,1675,1678,1682,1684,1687,1694,1705,1714,1720,1727,1733,1752,1756,1763,1768,1773,1776,1778,1784,1792,1795,1798,1801,1803,1804,1806,1808,1813,1815,1816,1817,1818,1825,1828,1831,1836,1841,1844,1854,1857,1861]
[null,null,"Luxembourg",498153,61296,0,0,0,0,0,0,0,0,0,0,0,0,0,0,0,0,0,0,0,0,0,0,0,0,0,0,0,0,0,0,0,0,0,0,0,0,0,0,1,1,1,1,1,1,2,2,3,3,5,7,19,34,51,59,77,140,203,335,484,670,798,875,1099,1333,1453,1605,1831,1950,1988,2178,2319,2487,2612,2729,2804,2843,2970,3034,3115,3223,3270,3281,3292,3307,3373,3444,3480,3537,3550,3558,3618,3654,3665,3695,3711,3723,3729,3741,3769,3784,3802,3812,3824,3828,3840,3851,3859,3871,3877,3886,3888,3894,3904,3915,3923,3930,3945,3947,3958,3971,3980,3981,3990,3992,3993,3995,4001,4008,4012,4016,4018,4019,4020,4024,4027,4032,4035,4039,4040,4046,4049,4052,4055,4063,4070,4072,4075,4085,4091,4099,4105,4120,4121,4133,4140,4151,4173,4217,4242,4256,4299,4345,4395,4447,4476,4522,4542,4603,4650,4719,4777]
[null,null,"Madagascar",-187669,468691,0,0,0,0,0,0,0,0,0,0,0,0,0,0,0,0,0,0,0,0,0,0,0,0,0,0,0,0,0,0,0,0,0,0,0,0,0,0,0,0,0,0,0,0,0,0,0,0,0,0,0,0,0,0,0,0,0,0,3,3,3,12,17,19,23,26,26,39,43,57,57,59,70,70,72,82,88,93,93,93,102,106,106,108,110,111,117,120,121,121,121,121,121,122,123,124,128,128,128,128,132,135,149,149,151,158,193,193,193,193,186,186,212,230,238,283,304,322,326,371,405,448,488,527,542,586,612,656,698,758,771,826,845,908,957,975,1026,1052,1094,1138,1162,1203,1240,1252,1272,1290,1317,1378,1403,1443,1503,1596,1640,1724,1787,1829,1922,2005,2078,2138,2214,2303,2403,2512,2728,2941,3250,3472,3573,3782,4143]
[null,null,"Malaysia","2020-05-02","112.5",0,0,0,3,4,4,4,7,8,8,8,8,8,10,12,12,12,16,16,18,18,18,19,19,22,22,22,22,22,22,22,22,22,22,22,22,23,23,25,29,29,36,50,50,83,93,99,117,129,149,149,197,238,428,566,673,790,900,1030,1183,1306,1518,1624,1796,2031,2161,2320,2470,2626,2766,2908,3116,3333,3483,3662,3793,3963,4119,4228,4346,4530,4683,4817,4987,5072,5182,5251,5305,5389,5425,5482,5532,5603,5691,5742,5780,5820,5851,5945,6002,6071,6176,6298,6353,6383,6428,6467,6535,6589,6656,6726,6742,6779,6819,6855,6872,6894,6941,6978,7009,7059,7137,7185,7245,7417,7604,7619,7629,7732,7762,7819,7857,7877,7970,8247,8266,8303,8322,8329,8336,8338,8369,8402,8445,8453,8494,8505,8515,8529,8535,8556,8572,8587,8590,8596,8600,8606,8616,8634,8637,8639,8640,8643,8648,8658,8663,8668,8674,8677,8683,8696]
[null,null,"Maldives",32028,732207,0,0,0,0,0,0,0,0,0,0,0,0,0,0,0,0,0,0,0,0,0,0,0,0,0,0,0,0,0,0,0,0,0,0,0,0,0,0,0,0,0,0,0,0,0,0,4,4,6,8,8,9,10,13,13,13,13,13,13,13,13,13,13,13,13,16,16,17,17,18,19,19,19,19,19,19,19,19,19,19,19,20,20,20,22,25,28,35,52,69,83,86,108,129,177,214,226,250,278,468,491,519,527,541,573,617,648,744,790,835,897,904,955,982,1031,1078,1094,1106,1143,1186,1216,1274,1313,1371,1395,1438,1457,1513,1591,1672,1773,1829,1841,1850,1872,1883,1901,1903,1916,1942,1962,1976,2003,2013,2035,2065,2094,2120,2137,2150,2187,2203,2217,2238,2261,2277,2283,2305,2324,2337,2361,2382,2400,2410,2435,2468,2491,2501,2517,2553,2617]
[null,null,"Malta",359375,143754,0,0,0,0,0,0,0,0,0,0,0,0,0,0,0,0,0,0,0,0,0,0,0,0,0,0,0,0,0,0,0,0,0,0,0,0,0,0,0,0,0,0,0,0,0,3,3,3,5,6,6,12,18,21,30,38,38,53,64,73,90,107,110,129,134,139,149,151,156,169,188,196,202,213,227,241,293,299,337,350,370,378,384,393,399,412,422,426,427,431,443,444,445,447,448,448,450,458,463,465,467,468,477,480,482,484,486,489,490,496,503,506,508,522,532,546,553,558,569,584,599,600,609,610,611,611,612,616,616,618,618,619,620,622,622,625,627,629,630,632,635,640,645,646,649,650,656,662,663,663,664,665,665,665,665,668,670,670,670,670,670,671,671,672,672,672,672,673,673,674,674]
[null,null,"Mauritania",210079,109408,0,0,0,0,0,0,0,0,0,0,0,0,0,0,0,0,0,0,0,0,0,0,0,0,0,0,0,0,0,0,0,0,0,0,0,0,0,0,0,0,0,0,0,0,0,0,0,0,0,0,0,0,1,1,1,1,1,2,2,2,2,2,2,2,3,3,5,5,5,6,6,6,6,6,6,6,6,6,7,7,7,7,7,7,7,7,7,7,7,7,7,7,7,7,7,7,7,7,8,8,8,8,8,8,8,8,8,8,8,8,8,9,15,20,29,40,62,81,131,141,173,200,227,237,262,268,292,346,423,483,530,588,668,745,784,883,947,1049,1104,1162,1283,1439,1572,1682,1783,1887,2057,2223,2424,2621,2813,2984,3121,3292,3519,3739,3907,4025,4149,4237,4363,4472,4606,4705,4827,4879,4948,5024,5087,5126,5203]
[null,null,"Mauritius","-20.2","57.5",0,0,0,0,0,0,0,0,0,0,0,0,0,0,0,0,0,0,0,0,0,0,0,0,0,0,0,0,0,0,0,0,0,0,0,0,0,0,0,0,0,0,0,0,0,0,0,0,0,0,0,0,0,0,0,0,3,3,12,14,28,36,42,48,81,94,102,107,128,143,161,169,186,196,227,244,268,273,314,318,319,324,324,324,324,324,324,325,328,328,328,329,331,331,331,332,334,334,332,332,332,332,332,332,332,332,332,332,332,332,332,332,332,332,332,332,332,332,332,332,332,332,332,334,334,334,334,334,335,335,335,335,335,335,335,337,337,337,337,337,337,337,337,337,337,337,337,337,337,337,337,337,340,340,341,341,341,341,341,341,341,341,341,341,341,341,342,342,342,342,342]
[null,null,"Mexico",236345,-1025528,0,0,0,0,0,0,0,0,0,0,0,0,0,0,0,0,0,0,0,0,0,0,0,0,0,0,0,0,0,0,0,0,0,0,0,0,0,1,4,5,5,5,5,5,6,6,7,7,7,8,12,26,41,53,82,93,118,164,203,251,316,367,405,475,585,717,848,993,1094,1215,1378,1510,1688,1890,2143,2439,2785,3181,3441,3844,4219,4661,5014,5399,5847,6297,6875,7497,8261,8772,9501,10544,11633,12872,13842,14677,15529,16752,17799,19224,20739,22088,23471,24905,26025,27634,29616,31522,33460,35022,36327,38324,40186,42595,45032,47144,49219,51633,54346,56594,59567,62527,65856,68620,71105,74560,78023,81400,84627,87512,90664,93435,97326,101238,105680,110026,113619,117103,120102,124301,129184,133974,139196,142690,146837,150264,154863,159793,165455,170485,175202,180545,185122,191410,196847,202951,208392,212802,216852,220657,226089,231770,238511,245251,252165,256848,261750,268008,275003,282283,289174]
[null,null,"Moldova",474116,283699,0,0,0,0,0,0,0,0,0,0,0,0,0,0,0,0,0,0,0,0,0,0,0,0,0,0,0,0,0,0,0,0,0,0,0,0,0,0,0,0,0,0,0,0,0,0,1,1,3,3,3,6,12,23,23,30,30,49,66,80,94,109,125,149,177,199,231,263,298,353,423,505,591,752,864,965,1056,1174,1289,1438,1560,1662,1712,1934,2049,2154,2264,2378,2472,2548,2614,2778,2926,3110,3304,3408,3481,3638,3771,3897,3980,4052,4121,4248,4363,4476,4605,4728,4867,4927,4995,5154,5406,5553,5745,5934,6060,6138,6340,6553,6704,6847,6994,7093,7147,7305,7537,7725,7896,8098,8251,8360,8548,8795,9018,9247,9511,9700,9807,10025,10321,10727,11093,11459,11740,11879,12254,12732,13106,13556,13953,14200,14363,14714,15078,15453,15776,16080,16250,16357,16613,16898,17150,17445,17672,17814,17906,18141,18471,18666,18924]
[null,null,"Monaco",437333,74167,0,0,0,0,0,0,0,0,0,0,0,0,0,0,0,0,0,0,0,0,0,0,0,0,0,0,0,0,0,0,0,0,0,0,0,0,0,0,1,1,1,1,1,1,1,1,1,1,1,1,2,2,2,2,7,7,7,7,11,11,23,23,23,31,33,42,42,46,49,52,55,60,64,66,73,77,79,81,84,90,92,93,93,93,93,93,94,94,94,94,94,94,94,94,94,94,95,95,95,95,95,95,95,95,95,95,95,95,96,96,96,96,96,96,96,96,96,97,97,97,97,97,98,98,98,98,98,98,98,99,99,99,99,99,99,99,99,99,99,99,99,99,99,99,99,99,99,99,99,99,99,100,101,101,102,102,102,103,103,103,103,103,106,106,106,108,108,108,108,108,108]
[null,null,"Mongolia",468625,1038467,0,0,0,0,0,0,0,0,0,0,0,0,0,0,0,0,0,0,0,0,0,0,0,0,0,0,0,0,0,0,0,0,0,0,0,0,0,0,0,0,0,0,0,0,0,0,0,0,1,1,1,1,1,1,1,5,6,6,6,10,10,10,10,10,11,11,12,12,12,12,14,14,14,14,14,15,15,16,16,16,16,16,17,30,30,31,31,31,32,33,34,35,36,37,37,38,38,38,38,38,38,39,39,40,41,41,41,42,42,42,42,42,42,98,98,135,136,140,140,140,140,141,141,141,141,141,148,161,179,179,179,185,185,185,186,191,193,193,194,194,194,197,197,197,197,197,197,201,204,204,206,213,215,215,216,219,219,219,220,220,220,220,220,220,220,220,225,227,227,227,227]
[null,null,"Montenegro","42.5","2020-03-19",0,0,0,0,0,0,0,0,0,0,0,0,0,0,0,0,0,0,0,0,0,0,0,0,0,0,0,0,0,0,0,0,0,0,0,0,0,0,0,0,0,0,0,0,0,0,0,0,0,0,0,0,0,0,0,2,2,3,14,14,21,27,47,52,69,82,84,85,91,109,123,144,174,201,214,233,241,248,252,255,263,272,274,283,288,303,303,307,308,312,313,315,316,319,320,321,321,321,322,322,322,322,322,323,324,324,324,324,324,324,324,324,324,324,324,324,324,324,324,324,324,324,324,324,324,324,324,324,324,324,324,324,324,324,324,324,324,324,324,324,324,324,324,324,325,326,326,333,337,355,359,362,367,378,389,414,439,469,481,501,548,576,616,663,720,781,841,907,960,1019,1019]
[null,null,"Morocco",317917,-70926,0,0,0,0,0,0,0,0,0,0,0,0,0,0,0,0,0,0,0,0,0,0,0,0,0,0,0,0,0,0,0,0,0,0,0,0,0,0,0,0,1,1,1,2,2,2,2,2,3,5,6,7,17,28,29,38,49,63,77,96,115,143,170,225,275,345,402,479,556,617,654,708,791,919,1021,1120,1184,1275,1374,1448,1545,1661,1763,1888,2024,2283,2564,2685,2855,3046,3209,3446,3568,3758,3897,4065,4120,4252,4321,4423,4569,4729,4903,5053,5219,5408,5548,5711,5910,6063,6281,6418,6512,6607,6652,6741,6870,6952,7023,7133,7211,7332,7406,7433,7532,7577,7601,7643,7714,7780,7807,7833,7866,7922,8003,8071,8151,8224,8302,8437,8508,8537,8610,8692,8793,8885,8931,8997,9074,9613,9839,9977,10172,10344,10907,11338,11633,11877,12052,12290,12533,12636,12969,13288,13822,14215,14379,14607,14771,15079,15328]
[null,null,"Namibia",-229576,184904,0,0,0,0,0,0,0,0,0,0,0,0,0,0,0,0,0,0,0,0,0,0,0,0,0,0,0,0,0,0,0,0,0,0,0,0,0,0,0,0,0,0,0,0,0,0,0,0,0,0,0,0,2,2,2,2,2,3,3,3,3,4,7,7,8,8,8,11,11,11,14,14,14,14,16,16,16,16,16,16,16,16,16,16,16,16,16,16,16,16,16,16,16,16,16,16,16,16,16,16,16,16,16,16,16,16,16,16,16,16,16,16,16,16,16,16,16,16,16,16,18,19,20,21,21,21,22,22,23,23,24,25,25,25,25,25,29,29,31,31,31,31,31,32,32,32,34,36,39,45,46,55,63,72,76,102,121,136,183,196,205,285,293,350,375,412,485,539,593,615,668]
[null,null,"Nepal",281667,"84.25",0,0,0,1,1,1,1,1,1,1,1,1,1,1,1,1,1,1,1,1,1,1,1,1,1,1,1,1,1,1,1,1,1,1,1,1,1,1,1,1,1,1,1,1,1,1,1,1,1,1,1,1,1,1,1,1,1,1,1,1,1,2,2,3,3,4,5,5,5,5,5,6,6,9,9,9,9,9,9,9,9,12,14,16,16,16,30,31,31,31,43,45,48,49,49,52,52,54,57,57,59,59,75,75,82,99,101,102,110,110,134,217,250,249,267,291,295,375,402,427,457,516,584,603,682,772,886,1042,1212,1401,1572,1811,2099,2300,2634,2912,3235,3448,3762,4086,4364,4614,5062,5335,5760,6211,6591,7177,7848,8274,8605,9026,9561,10099,10728,11162,11755,12309,12772,13248,13564,14046,14519,15259,15491,15784,15964,16168,16423,16531,16649]
[null,"Aruba","Netherlands",125186,-700358,0,0,0,0,0,0,0,0,0,0,0,0,0,0,0,0,0,0,0,0,0,0,0,0,0,0,0,0,0,0,0,0,0,0,0,0,0,0,0,0,0,0,0,0,0,0,0,0,0,0,0,2,2,2,2,3,4,4,5,5,9,9,12,17,28,33,46,50,50,55,55,60,62,64,64,71,74,77,82,86,92,92,92,92,93,95,96,96,97,97,97,100,100,100,100,100,100,100,100,100,100,100,100,100,101,101,101,101,101,101,101,101,101,101,101,101,101,101,101,101,101,101,101,101,101,101,101,101,101,101,101,101,101,101,101,101,101,101,101,101,101,101,101,101,101,101,101,101,101,101,101,101,101,101,101,101,101,101,101,103,103,103,104,104,105,105,105,105,105,105,105]
[null,"Curacao","Netherlands",121696,"-68.99",0,0,0,0,0,0,0,0,0,0,0,0,0,0,0,0,0,0,0,0,0,0,0,0,0,0,0,0,0,0,0,0,0,0,0,0,0,0,0,0,0,0,0,0,0,0,0,0,0,0,0,0,1,1,1,3,3,3,3,3,3,4,6,6,6,8,8,8,11,11,11,11,11,11,11,13,13,14,14,14,14,14,14,14,14,14,14,14,14,14,14,14,14,16,16,16,16,16,16,16,16,16,16,16,16,16,16,16,16,16,16,16,16,16,16,16,16,16,16,16,16,16,17,17,18,18,18,18,18,19,19,19,20,21,21,21,21,21,21,21,22,22,22,22,22,22,23,23,23,23,23,23,23,23,23,23,23,23,23,23,23,23,23,23,23,23,23,23,23,25,25]
[null,"Sint Maarten","Netherlands",180425,-630548,0,0,0,0,0,0,0,0,0,0,0,0,0,0,0,0,0,0,0,0,0,0,0,0,0,0,0,0,0,0,0,0,0,0,0,0,0,0,0,0,0,0,0,0,0,0,0,0,0,0,0,0,0,0,0,0,0,0,1,1,1,2,2,3,3,3,3,6,6,6,16,18,23,23,25,37,40,40,43,50,50,50,50,52,53,57,57,64,67,67,67,71,73,73,73,74,74,75,75,75,76,76,76,76,76,76,76,76,76,76,76,76,76,76,76,77,77,77,77,77,77,77,77,77,77,77,77,77,77,77,77,77,77,77,77,77,77,77,77,77,77,77,77,77,77,77,77,77,77,77,77,77,77,77,77,77,77,77,77,77,77,77,77,77,78,78,78,78,78,78,78]
[null,null,"Netherlands",521326,52913,0,0,0,0,0,0,0,0,0,0,0,0,0,0,0,0,0,0,0,0,0,0,0,0,0,0,0,0,0,0,0,0,0,0,0,0,1,1,6,10,18,24,38,82,128,188,265,321,382,503,503,804,959,1135,1413,1705,2051,2460,2994,3631,4204,4749,5560,6412,7431,8603,9762,10866,11750,12595,13614,14697,15723,16627,17851,18803,19580,20549,21762,23097,24413,25587,26551,27419,28153,29214,30449,31589,32655,33405,34134,34842,35729,36535,37190,37845,38245,38416,38802,39316,39791,40236,40571,40770,41087,41319,41774,42093,42382,42627,42788,42984,43211,43481,43681,43870,43995,44141,44249,44447,44700,44888,45064,45236,45445,45578,45768,45950,46126,46257,46442,46545,46647,46733,46942,47152,47335,47574,47739,47903,48087,48251,48461,48640,48783,48948,49087,49204,49319,49426,49502,49593,49658,49722,49804,49914,50005,50074,50147,50223,50273,50273,50335,50335,50335,50621,50657,50694,50746,50798,50840]
[null,null,"New Zealand",-409006,174886,0,0,0,0,0,0,0,0,0,0,0,0,0,0,0,0,0,0,0,0,0,0,0,0,0,0,0,0,0,0,0,0,0,0,0,0,0,1,1,1,1,1,3,3,4,5,5,5,5,5,5,5,6,8,8,12,20,28,39,52,102,102,155,205,283,368,451,514,589,647,708,797,868,950,1039,1106,1160,1210,1239,1283,1312,1330,1349,1366,1386,1401,1409,1422,1431,1440,1445,1451,1456,1461,1470,1469,1472,1474,1476,1479,1485,1487,1487,1486,1488,1489,1490,1492,1494,1497,1497,1497,1497,1498,1498,1499,1499,1499,1503,1503,1504,1504,1504,1504,1504,1504,1504,1504,1504,1504,1504,1504,1504,1504,1504,1504,1504,1504,1504,1504,1504,1504,1504,1504,1504,1506,1506,1507,1507,1509,1511,1513,1515,1516,1519,1520,1522,1526,1528,1528,1528,1530,1530,1530,1533,1534,1536,1537,1540,1542,1543]
[null,null,"Nicaragua",128654,-852072,0,0,0,0,0,0,0,0,0,0,0,0,0,0,0,0,0,0,0,0,0,0,0,0,0,0,0,0,0,0,0,0,0,0,0,0,0,0,0,0,0,0,0,0,0,0,0,0,0,0,0,0,0,0,0,0,0,1,1,2,2,2,2,2,2,2,4,4,4,5,5,5,5,5,6,6,6,6,7,7,8,9,9,9,9,9,9,9,10,10,10,10,11,11,12,13,13,13,13,14,14,14,15,15,16,16,16,16,16,16,16,25,25,25,25,25,25,25,254,254,279,279,279,279,279,759,759,759,759,759,759,759,1118,1118,1118,1118,1118,1118,1118,1464,1464,1464,1464,1464,1464,1464,1823,1823,1823,1823,1823,1823,1823,2170,2170,2170,2170,2170,2170,2170,2519,2519,2519,2519,2519,2519,2519,2846,2846,2846,2846]
[null,null,"Niger",176078,80817,0,0,0,0,0,0,0,0,0,0,0,0,0,0,0,0,0,0,0,0,0,0,0,0,0,0,0,0,0,0,0,0,0,0,0,0,0,0,0,0,0,0,0,0,0,0,0,0,0,0,0,0,0,0,0,0,0,0,1,1,2,3,3,7,10,10,10,18,27,27,74,98,120,144,184,253,278,342,410,438,491,529,529,570,584,584,627,639,648,648,657,662,671,681,684,696,701,709,713,719,728,736,750,755,763,770,781,795,815,821,832,854,860,876,885,889,904,909,914,920,924,937,943,945,951,952,952,955,955,956,958,958,960,961,963,966,970,973,973,974,974,974,978,980,980,980,1016,1020,1020,1020,1035,1036,1046,1051,1051,1056,1059,1062,1074,1075,1075,1075,1081,1082,1082,1088,1093,1094,1097,1097,1099]
[null,null,"Nigeria",9082,86753,0,0,0,0,0,0,0,0,0,0,0,0,0,0,0,0,0,0,0,0,0,0,0,0,0,0,0,0,0,0,0,0,0,0,0,0,0,1,1,1,1,1,1,1,1,1,1,2,2,2,2,2,2,2,2,3,8,8,12,22,30,40,44,51,65,70,89,111,131,135,174,184,210,214,232,238,254,276,288,305,318,323,343,373,407,442,493,542,627,665,665,873,981,1095,1182,1273,1337,1532,1728,1932,2170,2388,2558,2802,2950,3145,3526,3912,4151,4399,4641,4787,4971,5162,5450,5621,5959,6175,6401,6677,7016,7261,7526,7839,8068,8344,8733,8915,9302,9855,10162,10578,10819,11166,11516,11844,12233,12486,12801,13464,13873,14554,15181,15682,16085,16658,17148,17735,18480,19147,19808,20244,20919,21371,22020,22614,23298,24077,24567,25133,25694,26484,27110,27564,28167,28711,29286,29789,30249,30748,31323]
[null,null,"North Macedonia",416086,217453,0,0,0,0,0,0,0,0,0,0,0,0,0,0,0,0,0,0,0,0,0,0,0,0,0,0,0,0,0,0,0,0,0,0,0,1,1,1,1,1,1,1,1,1,3,3,3,3,7,7,7,14,14,14,18,26,35,48,67,85,115,136,148,177,201,219,241,259,285,329,354,384,430,483,555,570,599,617,663,711,760,828,854,908,974,1081,1117,1170,1207,1225,1231,1259,1300,1326,1367,1386,1399,1421,1442,1465,1494,1506,1511,1518,1526,1539,1572,1586,1622,1642,1664,1674,1694,1723,1740,1762,1792,1817,1839,1858,1898,1921,1941,1978,1999,2014,2039,2077,2129,2164,2226,2315,2391,2492,2611,2790,2915,3025,3152,3239,3364,3538,3701,3895,4057,4157,4299,4482,4664,4820,5005,5106,5196,5311,5445,5595,5758,5906,6080,6209,6334,6454,6625,6787,6932,7046,7124,7244,7406,7572,7777]
[null,null,"Norway",60472,84689,0,0,0,0,0,0,0,0,0,0,0,0,0,0,0,0,0,0,0,0,0,0,0,0,0,0,0,0,0,0,0,0,0,0,0,1,1,6,15,19,25,32,56,87,108,147,176,205,400,598,702,996,1090,1221,1333,1463,1550,1746,1914,2118,2385,2621,2863,3084,3369,3755,4015,4284,4445,4641,4863,5147,5370,5550,5687,5865,6086,6086,6211,6314,6409,6525,6603,6623,6740,6896,6937,7036,7078,7156,7191,7338,7401,7463,7499,7527,7599,7660,7710,7738,7783,7809,7847,7904,7955,7996,8034,8070,8099,8105,8132,8157,8175,8196,8219,8237,8249,8257,8267,8281,8309,8332,8346,8352,8364,8383,8401,8411,8422,8437,8440,8446,8455,8477,8504,8522,8531,8547,8561,8576,8594,8608,8620,8628,8631,8647,8660,8692,8708,8726,8742,8745,8751,8772,8788,8788,8832,8846,8855,8862,8879,8896,8902,8921,8926,8930,8936,8947,8950,8965,8974]
[null,null,"Oman","21.0","57.0",0,0,0,0,0,0,0,0,0,0,0,0,0,0,0,0,0,0,0,0,0,0,0,0,0,0,0,0,0,0,0,0,0,2,2,4,4,4,6,6,6,12,15,16,16,16,16,16,18,18,18,19,19,22,22,24,39,48,48,52,55,66,84,99,109,131,152,167,179,192,210,231,252,277,298,331,371,419,457,484,546,599,727,813,910,1019,1069,1180,1266,1410,1508,1614,1716,1790,1905,1998,2049,2131,2274,2348,2447,2483,2568,2637,2735,2903,2958,3112,3224,3399,3573,3721,4019,4341,4625,5029,5186,5379,5671,6043,6370,6794,7257,7770,7770,8118,8373,9009,9820,10423,11437,12223,12799,13537,14316,15086,16016,16882,17486,18198,18887,19954,21071,22077,23481,24524,25269,26079,26818,27670,28566,29471,31076,32394,33536,34902,36034,36953,38150,39060,40070,41194,42555,43929,45106,46178,47735,48997,50207,51725,53614]
[null,null,"Pakistan",303753,693451,0,0,0,0,0,0,0,0,0,0,0,0,0,0,0,0,0,0,0,0,0,0,0,0,0,0,0,0,0,0,0,0,0,0,2,2,2,4,4,4,5,5,5,6,6,6,6,16,19,20,28,31,53,136,236,299,454,501,730,776,875,972,1063,1201,1373,1495,1597,1717,1938,2118,2421,2686,2818,3157,3766,4035,4263,4489,4695,5011,5230,5496,5837,6383,6919,7025,7638,8348,8418,9565,10076,11155,11940,12723,13328,13915,14612,15525,16817,18114,19103,20084,20941,22049,24073,24644,26435,28736,30334,32081,34336,35298,35788,38799,38799,40151,42125,43966,45898,48091,50694,52437,54601,56349,57705,59151,61227,64028,66457,69496,72460,76398,80463,85264,89249,93983,98943,103671,108317,113702,119536,125933,125933,132405,144478,148921,154760,160118,165062,171666,176617,181088,185034,188926,192970,195745,198883,202955,206512,209337,213470,217809,221896,221896,225283,231818,234509,237489,240848,243599,246351]
[null,null,"Panama",8538,-807821,0,0,0,0,0,0,0,0,0,0,0,0,0,0,0,0,0,0,0,0,0,0,0,0,0,0,0,0,0,0,0,0,0,0,0,0,0,0,0,0,0,0,0,0,0,0,0,0,1,8,11,27,36,43,55,69,86,109,137,200,313,345,345,443,558,674,786,901,989,1181,1181,1317,1475,1673,1801,1988,2100,2249,2528,2752,2974,3234,3400,3472,3574,3751,4016,4210,4273,4467,4658,4821,5166,5338,5538,5779,6021,6021,6378,6532,6720,7090,7090,7197,7523,7731,7868,8070,8282,8448,8616,8783,8944,9118,9268,9449,9606,9726,9867,9977,10116,10267,10577,10926,11183,11447,11728,12131,12531,13018,13463,13837,14095,14609,15044,15463,16004,16425,16854,17233,17889,18586,19211,20059,21418,21422,21962,22597,23351,24274,25222,26030,26752,27314,28030,29037,29905,30658,31686,32785,33550,34463,35237,35995,36983,38149,39334,40291,41251,42216,43257]
[null,null,"Papua New Guinea",-6315,1439555,0,0,0,0,0,0,0,0,0,0,0,0,0,0,0,0,0,0,0,0,0,0,0,0,0,0,0,0,0,0,0,0,0,0,0,0,0,0,0,0,0,0,0,0,0,0,0,0,0,0,0,0,0,0,0,0,0,0,1,1,1,1,1,1,1,1,1,1,1,1,1,1,1,1,1,2,2,2,2,2,2,2,2,2,2,7,7,7,7,7,7,8,8,8,8,8,8,8,8,8,8,8,8,8,8,8,8,8,8,8,8,8,8,8,8,8,8,8,8,8,8,8,8,8,8,8,8,8,8,8,8,8,8,8,8,8,8,8,8,8,8,8,8,8,8,8,8,8,8,8,8,8,9,9,10,10,11,11,11,11,11,11,11,11,11,11,11,11,11,11,11]
[null,null,"Paraguay",-234425,-584438,0,0,0,0,0,0,0,0,0,0,0,0,0,0,0,0,0,0,0,0,0,0,0,0,0,0,0,0,0,0,0,0,0,0,0,0,0,0,0,0,0,0,0,0,0,0,1,1,1,5,5,6,6,6,8,9,11,11,13,18,22,22,27,37,41,52,56,59,64,65,69,77,92,96,104,113,115,119,124,129,133,134,147,159,161,174,199,202,206,208,208,213,213,223,228,228,228,239,239,266,333,370,396,415,431,440,462,563,689,713,724,737,740,754,759,778,786,788,829,833,836,838,850,862,865,877,884,900,917,964,986,995,1013,1070,1086,1087,1090,1135,1145,1187,1202,1230,1254,1261,1289,1296,1303,1308,1330,1336,1362,1379,1392,1422,1528,1569,1711,1942,2127,2191,2221,2260,2303,2349,2385,2427,2456,2502,2554,2638,2736]
[null,null,"Peru","-9.19",-750152,0,0,0,0,0,0,0,0,0,0,0,0,0,0,0,0,0,0,0,0,0,0,0,0,0,0,0,0,0,0,0,0,0,0,0,0,0,0,0,0,0,0,0,0,1,1,6,7,11,11,15,28,38,43,86,117,145,234,234,318,363,395,416,480,580,635,671,852,950,1065,1323,1414,1595,1746,2281,2561,2954,4342,5256,5897,6848,7519,9784,10303,11475,12491,13489,14420,15628,16325,17837,19250,20914,21648,25331,27517,28699,31190,33931,36976,40459,42534,45928,47372,51189,54817,58526,61847,65015,67307,68822,72059,76306,80604,84495,88541,92273,94933,99483,104020,108769,111698,115754,119959,123979,129751,135905,141779,148285,155671,164476,170039,170039,178914,183198,187400,191758,196515,199696,203736,208823,214788,214788,220749,229736,232992,237156,240908,244388,247925,251338,254936,257447,260810,264689,268602,272364,275989,279419,282365,285213,288477,292004,295599,299080,302718,305703,309278,312911,316448,319646]
[null,null,"Philippines","13.0","122.0",0,0,0,0,0,0,0,0,1,1,1,2,2,2,2,2,3,3,3,3,3,3,3,3,3,3,3,3,3,3,3,3,3,3,3,3,3,3,3,3,3,3,3,3,5,6,10,20,33,49,52,64,111,140,142,187,202,217,230,307,380,462,552,636,707,803,1075,1418,1546,2084,2311,2633,3018,3094,3246,3660,3764,3870,4076,4195,4428,4648,4932,5223,5453,5660,5878,6087,6259,6459,6599,6710,6981,7192,7294,7579,7777,7958,8212,8488,8772,8928,9223,9485,9684,10004,10343,10463,10610,10794,11086,11350,11618,11876,12091,12305,12513,12718,12942,13221,13434,13597,13777,14035,14319,14669,15049,15588,16634,17224,18086,18638,18997,19748,20382,20626,21340,21895,22474,22992,23732,24175,24787,25392,25930,26420,26781,27238,27799,28459,29400,30052,30682,31825,32295,33069,34073,34803,35455,36438,37514,38511,38805,40336,41830,44254,46333,47873,50359,51754,52914]
[null,null,"Poland",519194,191451,0,0,0,0,0,0,0,0,0,0,0,0,0,0,0,0,0,0,0,0,0,0,0,0,0,0,0,0,0,0,0,0,0,0,0,0,0,0,0,0,0,0,1,1,5,5,11,16,22,31,49,68,103,119,177,238,251,355,425,536,634,749,901,1051,1221,1389,1638,1862,2055,2311,2554,2946,3383,3627,4102,4413,4848,5205,5575,5955,6356,6674,6934,7202,7582,7918,8379,8742,9287,9593,9856,10169,10511,10892,11273,11617,11902,12218,12640,12877,13105,13375,13693,14006,14431,14740,15047,15366,15651,15996,16326,16921,17204,17615,18016,18257,18529,18885,19268,19739,20143,20619,20931,21326,21631,22074,22473,22825,23155,23571,23786,24165,24395,24687,25048,25410,25986,26561,27160,27560,27842,28201,28577,29017,29392,29788,30195,30701,31015,31316,31620,31931,32227,32527,32821,33119,33395,33714,33907,34154,34393,34775,35146,35405,35719,35950,36155,36412,36689,36951,37216]
[null,null,"Portugal",393999,-82245,0,0,0,0,0,0,0,0,0,0,0,0,0,0,0,0,0,0,0,0,0,0,0,0,0,0,0,0,0,0,0,0,0,0,0,0,0,0,0,0,2,2,5,8,13,20,30,30,41,59,59,112,169,245,331,448,448,785,1020,1280,1600,2060,2362,2995,3544,4268,5170,5962,6408,7443,8251,9034,9886,10524,11278,11730,12442,13141,13956,15472,15987,16585,16934,17448,18091,18841,19022,19685,20206,20863,21379,21982,22353,22797,23392,23864,24027,24322,24505,25045,25351,25190,25282,25524,25702,26182,26715,27268,27406,27581,27679,27913,28132,28319,28583,28810,29036,29209,29432,29660,29912,30200,30471,30623,30788,31007,31292,31596,31946,32203,32500,32700,32895,33261,33592,33969,34351,34693,34885,35306,35600,35910,36180,36463,36690,37036,37336,37672,38089,38464,38841,39133,39392,39737,40104,40415,40866,41189,41646,41912,42141,42454,42782,43156,43569,43897,44129,44416,44859,45277,45679]
[null,null,"Qatar",253548,511839,0,0,0,0,0,0,0,0,0,0,0,0,0,0,0,0,0,0,0,0,0,0,0,0,0,0,0,0,0,0,0,0,0,0,0,0,0,0,1,3,3,7,8,8,8,8,15,18,24,262,262,320,337,401,439,439,452,460,470,481,494,501,526,537,549,562,590,634,693,781,835,949,1075,1325,1604,1832,2057,2210,2376,2512,2728,2979,3231,3428,3711,4103,4663,5008,5448,6015,6533,7141,7764,8525,9358,10287,11244,11921,12564,13409,14096,14872,15551,16191,17142,17972,18890,20201,21331,22520,23623,25149,26539,28272,29425,30972,32604,33969,35606,37097,38651,40481,42213,43714,45465,47207,48947,50914,52907,55262,56910,58433,60259,62160,63741,65495,67195,68790,70158,71879,73595,75071,76588,78416,79602,80876,82077,83174,84441,85462,86488,87369,88403,89579,90778,91838,92784,93663,94413,95106,96088,97003,97897,98653,99183,99799,100345,100945,101553,102110,102630]
[null,null,"Romania",459432,249668,0,0,0,0,0,0,0,0,0,0,0,0,0,0,0,0,0,0,0,0,0,0,0,0,0,0,0,0,0,0,0,0,0,0,0,1,1,3,3,3,3,3,4,6,9,9,15,15,25,45,49,89,123,131,158,184,260,277,308,367,433,576,794,906,1029,1292,1452,1815,2109,2245,2460,2738,3183,3613,3864,4057,4417,4761,5202,5467,5990,6300,6633,6879,7216,7707,8067,8418,8746,8936,9242,9710,10096,10417,10635,11036,11339,11616,11978,12240,12567,12732,13163,13512,13837,14107,14499,14811,15131,15362,15588,15778,16002,16247,16437,16704,16871,17036,17191,17387,17585,17712,17857,18070,18283,18429,18594,18791,18982,19133,19257,19398,19517,19669,19907,20103,20290,20479,20604,20749,20945,21182,21404,21679,21999,22165,22415,22760,23080,23400,23730,24045,24291,24505,24826,25286,25697,26022,26313,26582,26970,27296,27746,28166,28582,28973,29223,29620,30175,30789,31381]
[null,null,"Russia","60.0","90.0",0,0,0,0,0,0,0,0,0,2,2,2,2,2,2,2,2,2,2,2,2,2,2,2,2,2,2,2,2,2,2,2,2,2,2,2,2,2,2,2,3,3,3,4,13,13,17,17,20,20,28,45,59,63,90,114,147,199,253,306,367,438,495,658,840,1036,1264,1534,1836,2337,2777,3548,4149,4731,5389,6343,7497,8672,10131,11917,13584,15770,18328,21102,24490,27938,32008,36793,42853,47121,52763,57999,62773,68622,74588,80949,87147,93558,99399,106498,114431,124054,134687,145268,155370,165929,177160,187859,198676,209688,221344,232243,242271,252245,262843,272043,281752,290678,299941,308705,317554,326448,335882,344481,353427,362342,370680,379051,387623,396575,405843,414328,423186,431715,440538,449256,458102,467073,476043,484630,493023,501800,510761,519458,528267,536484,544725,552549,560321,568292,576162,583879,591465,598878,606043,613148,619936,626779,633563,640246,646929,653479,660231,666941,673564,680283,686852,693215,699749,706240,712863]
[null,null,"Rwanda",-19403,298739,0,0,0,0,0,0,0,0,0,0,0,0,0,0,0,0,0,0,0,0,0,0,0,0,0,0,0,0,0,0,0,0,0,0,0,0,0,0,0,0,0,0,0,0,0,0,0,0,0,0,0,0,1,1,5,7,8,8,17,17,19,36,40,41,50,54,60,70,70,75,82,84,89,102,104,105,105,110,110,118,120,126,127,134,136,138,143,144,147,147,150,153,154,176,183,191,207,212,225,243,249,255,259,261,261,268,271,273,280,284,285,286,287,287,287,289,292,297,308,314,320,321,325,327,336,339,346,349,355,359,370,377,384,397,410,420,431,439,451,463,476,494,510,541,582,612,636,639,646,661,702,728,787,798,830,850,858,878,900,1001,1025,1042,1063,1081,1092,1105,1113,1172,1194,1210,1252]
[null,null,"Saint Lucia",139094,-609789,0,0,0,0,0,0,0,0,0,0,0,0,0,0,0,0,0,0,0,0,0,0,0,0,0,0,0,0,0,0,0,0,0,0,0,0,0,0,0,0,0,0,0,0,0,0,0,0,0,0,0,0,1,2,2,2,2,2,2,2,2,3,3,3,3,3,3,9,9,13,13,13,13,14,14,14,14,14,14,15,15,15,15,15,15,15,15,15,15,15,15,15,15,15,15,15,15,15,17,17,17,17,18,18,18,18,18,18,18,18,18,18,18,18,18,18,18,18,18,18,18,18,18,18,18,18,18,18,18,18,18,18,18,18,19,19,19,19,19,19,19,19,19,19,19,19,19,19,19,19,19,19,19,19,19,19,19,19,19,19,19,19,19,22,22,22,22,22,22,22,22]
[null,null,"Saint Vincent and the Grenadines",129843,-612872,0,0,0,0,0,0,0,0,0,0,0,0,0,0,0,0,0,0,0,0,0,0,0,0,0,0,0,0,0,0,0,0,0,0,0,0,0,0,0,0,0,0,0,0,0,0,0,0,0,0,0,0,1,1,1,1,1,1,1,1,1,1,1,1,1,1,1,1,1,1,1,2,3,7,7,7,8,8,12,12,12,12,12,12,12,12,12,12,12,12,12,13,13,14,14,14,15,15,16,16,16,16,16,17,17,17,17,17,17,17,17,17,17,17,17,17,17,17,17,18,18,18,18,18,18,18,18,25,26,26,26,26,26,26,26,26,26,27,27,27,27,27,27,27,27,27,29,29,29,29,29,29,29,29,29,29,29,29,29,29,29,29,29,29,29,29,29,29,29,29,29]
[null,null,"San Marino",439424,124578,0,0,0,0,0,0,0,0,0,0,0,0,0,0,0,0,0,0,0,0,0,0,0,0,0,0,0,0,0,0,0,0,0,0,0,0,1,1,1,1,8,10,16,21,21,23,36,36,51,62,69,80,80,101,109,109,119,119,144,144,175,187,187,208,208,223,224,224,230,236,236,245,245,259,266,266,279,279,333,344,356,356,356,371,372,426,435,455,461,462,476,488,501,513,513,538,538,553,563,569,580,580,582,582,589,608,622,623,637,628,628,638,643,648,652,653,654,654,655,656,658,661,665,665,666,666,667,670,671,671,671,671,672,674,678,680,680,680,687,688,691,691,694,694,694,694,694,696,696,696,696,696,697,698,698,698,698,698,698,698,698,698,698,698,698,698,698,698,698,699,699]
[null,null,"Saudi Arabia","24.0","45.0",0,0,0,0,0,0,0,0,0,0,0,0,0,0,0,0,0,0,0,0,0,0,0,0,0,0,0,0,0,0,0,0,0,0,0,0,0,0,0,0,1,1,1,5,5,5,11,15,20,21,45,86,103,103,118,171,171,274,344,392,511,562,767,900,1012,1104,1203,1299,1453,1563,1720,1885,2039,2179,2402,2605,2795,2932,3287,3651,4033,4462,4934,5369,5862,6380,7142,8274,9362,10484,11631,12772,13930,15102,16299,17522,18811,20077,21402,22753,24097,25459,27011,28656,30251,31938,33731,35432,37136,39048,41014,42925,44830,46869,49176,52016,54752,57345,59854,62545,65077,67719,70161,72560,74795,76726,78541,80185,81766,83384,85261,87142,89011,91182,93157,95748,98869,101914,105283,108571,112288,116021,119942,123308,127541,132048,136315,141234,145991,150292,154233,157612,161005,164144,167267,170639,174577,178504,182493,186436,190823,194225,197608,201801,205929,209509,213716,217108,220144,223327,226486]
[null,null,"Senegal",144974,-144524,0,0,0,0,0,0,0,0,0,0,0,0,0,0,0,0,0,0,0,0,0,0,0,0,0,0,0,0,0,0,0,0,0,0,0,0,0,0,0,0,1,2,4,4,4,4,4,4,4,4,4,10,10,24,24,26,31,31,38,47,67,79,86,99,105,119,130,142,162,175,190,195,207,219,222,226,237,244,250,265,278,280,291,299,314,335,342,350,367,377,412,442,479,545,614,671,736,823,882,933,1024,1115,1182,1271,1329,1433,1492,1551,1634,1709,1886,1995,2105,2189,2310,2429,2480,2544,2617,2714,2812,2909,2976,3047,3130,3161,3253,3348,3429,3535,3645,3739,3836,3932,4021,4155,4249,4328,4427,4516,4640,4759,4851,4996,5090,5173,5247,5369,5475,5639,5783,5888,5970,6034,6129,6233,6354,6459,6586,6698,6793,6925,7054,7164,7272,7400,7478,7547,7657,7784,7882]
[null,null,"Serbia",440165,210059,0,0,0,0,0,0,0,0,0,0,0,0,0,0,0,0,0,0,0,0,0,0,0,0,0,0,0,0,0,0,0,0,0,0,0,0,0,0,0,0,0,0,0,0,1,1,1,1,5,12,19,35,46,48,55,65,83,103,135,171,222,249,303,384,384,457,659,741,785,900,1060,1171,1476,1624,1908,2200,2447,2666,2867,3105,3380,3630,4054,4465,4873,5318,5690,5994,6318,6630,6890,7144,7276,7483,7779,8042,8275,8497,8724,9009,9009,9362,9464,9557,9677,9791,9848,9943,10032,10032,10176,10243,10295,10374,10438,10496,10610,10699,10733,10833,10919,11024,11092,11159,11193,11227,11275,11300,11354,11381,11412,11430,11454,11523,11571,11667,11741,11823,11896,11965,12031,12102,12175,12251,12310,12367,12426,12522,12616,12709,12803,12894,12990,13092,13235,13372,13565,13792,14046,14288,14564,14836,15195,15504,15829,16131,16420,16719,17076,17342,17728]
[null,null,"Seychelles",-46796,55492,0,0,0,0,0,0,0,0,0,0,0,0,0,0,0,0,0,0,0,0,0,0,0,0,0,0,0,0,0,0,0,0,0,0,0,0,0,0,0,0,0,0,0,0,0,0,0,0,0,0,0,0,2,2,3,4,4,6,7,7,7,7,7,7,7,7,8,8,8,10,10,10,10,10,10,11,11,11,11,11,11,11,11,11,11,11,11,11,11,11,11,11,11,11,11,11,11,11,11,11,11,11,11,11,11,11,11,11,11,11,11,11,11,11,11,11,11,11,11,11,11,11,11,11,11,11,11,11,11,11,11,11,11,11,11,11,11,11,11,11,11,11,11,11,11,11,11,11,11,11,11,11,11,11,11,11,11,20,70,77,81,81,81,81,81,81,81,81,91,94,100]
[null,null,"Singapore",12833,1038333,0,1,3,3,4,5,7,7,10,13,16,18,18,24,28,28,30,33,40,45,47,50,58,67,72,75,77,81,84,84,85,85,89,89,91,93,93,93,102,106,108,110,110,117,130,138,150,150,160,178,178,200,212,226,243,266,313,345,385,432,455,509,558,631,683,732,802,844,879,926,1000,1049,1114,1189,1309,1375,1481,1623,1910,2108,2299,2532,2918,3252,3699,4427,5050,5992,6588,8014,9125,10141,11178,12075,12693,13624,14423,14951,15641,16169,17101,17548,18205,18778,19410,20198,20939,21707,22460,23336,23822,24671,25346,26098,26891,27356,28038,28343,28794,29364,29812,30426,31068,31616,31960,32343,32876,33249,33860,34366,34884,35292,35836,36405,36922,37183,37527,37910,38296,38514,38965,39387,39850,40197,40604,40818,40969,41216,41473,41615,41833,42095,42313,42432,42623,42736,42955,43246,43459,43661,43907,44122,44310,44479,44664,44800,44983,45140,45298,45423,45614]
[null,null,"Slovakia",48669,19699,0,0,0,0,0,0,0,0,0,0,0,0,0,0,0,0,0,0,0,0,0,0,0,0,0,0,0,0,0,0,0,0,0,0,0,0,0,0,0,0,0,0,0,0,1,1,3,3,7,10,16,32,44,54,63,72,105,123,137,178,185,186,204,216,226,269,292,314,336,363,400,426,450,471,485,534,581,682,701,715,728,742,769,835,863,977,1049,1089,1161,1173,1199,1244,1325,1360,1373,1379,1381,1384,1391,1396,1403,1407,1408,1413,1421,1429,1445,1455,1455,1457,1457,1465,1469,1477,1480,1493,1494,1495,1495,1496,1502,1503,1504,1509,1511,1513,1515,1520,1520,1521,1521,1522,1522,1525,1526,1526,1528,1528,1530,1531,1533,1541,1542,1545,1548,1552,1552,1561,1562,1576,1586,1587,1588,1589,1607,1630,1643,1657,1664,1665,1667,1687,1700,1720,1749,1764,1765,1767,1798,1851,1870]
[null,null,"Slovenia",461512,149955,0,0,0,0,0,0,0,0,0,0,0,0,0,0,0,0,0,0,0,0,0,0,0,0,0,0,0,0,0,0,0,0,0,0,0,0,0,0,0,0,0,0,0,2,7,7,16,16,31,57,89,141,181,219,253,275,275,286,341,383,414,442,480,528,562,632,684,730,756,802,841,897,934,977,997,1021,1059,1091,1124,1160,1188,1205,1212,1220,1248,1268,1304,1317,1330,1335,1344,1353,1366,1373,1388,1396,1402,1408,1418,1429,1434,1439,1439,1439,1445,1448,1449,1450,1454,1457,1460,1461,1463,1464,1465,1465,1466,1466,1467,1468,1468,1468,1468,1468,1469,1469,1471,1473,1473,1473,1473,1473,1475,1477,1477,1479,1484,1485,1485,1486,1488,1488,1490,1492,1495,1496,1499,1503,1511,1513,1519,1520,1521,1534,1541,1547,1558,1572,1581,1585,1600,1613,1634,1650,1679,1700,1716,1739,1763,1776,1793]
[null,null,"Somalia",51521,461996,0,0,0,0,0,0,0,0,0,0,0,0,0,0,0,0,0,0,0,0,0,0,0,0,0,0,0,0,0,0,0,0,0,0,0,0,0,0,0,0,0,0,0,0,0,0,0,0,0,0,0,0,0,0,1,1,1,1,1,1,1,1,1,1,2,3,3,3,3,5,5,5,7,7,7,7,8,12,12,21,21,25,60,60,80,80,116,135,164,237,286,286,328,328,390,436,480,528,582,601,601,671,722,756,835,873,928,928,997,1054,1089,1170,1219,1284,1284,1357,1421,1455,1502,1573,1594,1594,1594,1594,1689,1711,1731,1828,1828,1916,1976,2023,2089,2146,2204,2204,2289,2334,2368,2416,2452,2513,2513,2579,2618,2642,2658,2696,2719,2719,2755,2779,2812,2812,2835,2878,2878,2878,2894,2904,2924,2924,2944,2944,2961,2997,3006,3015,3028,3038,3038]
[null,null,"South Africa",-305595,229375,0,0,0,0,0,0,0,0,0,0,0,0,0,0,0,0,0,0,0,0,0,0,0,0,0,0,0,0,0,0,0,0,0,0,0,0,0,0,0,0,0,0,0,1,1,1,3,3,7,13,17,24,38,51,62,62,116,150,202,240,274,402,554,709,927,1170,1187,1280,1326,1353,1380,1462,1505,1585,1655,1686,1749,1845,1934,2003,2028,2173,2272,2415,2506,2605,2783,3034,3158,3300,3465,3635,3953,4220,4361,4546,4793,4996,5350,5647,5951,6336,6783,7220,7572,7808,8232,8895,9420,10015,10652,11350,12074,12739,13524,14355,15515,16433,17200,18003,19137,20125,21343,22583,23615,24264,25937,27403,29240,30967,32683,34357,35812,37525,40792,43434,45973,48285,50879,52991,55421,58568,61927,65736,70038,73533,76334,80412,83890,87715,92681,97302,101590,106108,111796,118375,124590,131800,138134,144264,151209,159333,168061,177124,187977,196750,205721,215855,224665,238339,250687]
[null,null,"Spain","40.0","-4.0",0,0,0,0,0,0,0,0,0,0,1,1,1,1,1,1,1,1,2,2,2,2,2,2,2,2,2,2,2,2,2,2,2,2,6,13,15,32,45,84,120,165,222,259,400,500,673,1073,1695,2277,2277,5232,6391,7798,9942,11748,13910,17963,20410,25374,28768,35136,39885,49515,57786,65719,73235,80110,87956,95923,104118,112065,119199,126168,131646,136675,141942,148220,153222,158273,163027,166831,170099,172541,177644,184948,190839,191726,198674,200210,204178,208389,213024,202990,205905,207634,209465,210773,212917,213435,215216,216582,217466,218011,219329,220325,221447,222857,223578,224350,227436,228030,228691,229540,230183,230698,230698,231606,232037,232555,233037,234824,235290,235772,235400,236259,236259,237906,238564,239228,239479,239638,239932,240326,240660,240978,241310,241550,241717,241966,242280,242707,243209,243605,243928,244109,244328,244683,245268,245575,245938,246272,246504,246752,247086,247486,247905,248469,248770,248970,249271,249659,250103,250545,250545,250545,251789,252130,252513,253056,253908]
[null,null,"Sri Lanka","7.0","81.0",0,0,0,0,0,1,1,1,1,1,1,1,1,1,1,1,1,1,1,1,1,1,1,1,1,1,1,1,1,1,1,1,1,1,1,1,1,1,1,1,1,1,1,1,1,1,1,1,1,2,2,6,10,18,28,44,51,60,73,77,82,97,102,102,106,106,113,117,122,143,146,151,159,166,176,178,185,189,190,190,198,210,217,233,238,238,244,254,271,304,310,330,368,420,460,523,588,619,649,663,690,705,718,751,771,797,824,835,847,863,869,889,915,925,935,960,981,992,1027,1028,1055,1068,1089,1141,1182,1319,1469,1530,1558,1620,1633,1643,1683,1749,1797,1801,1814,1835,1857,1859,1869,1877,1880,1884,1889,1905,1915,1924,1947,1950,1950,1950,1951,1991,2001,2010,2014,2033,2037,2039,2047,2054,2066,2069,2074,2076,2077,2081,2094,2154,2454]
[null,null,"Sudan",128628,302176,0,0,0,0,0,0,0,0,0,0,0,0,0,0,0,0,0,0,0,0,0,0,0,0,0,0,0,0,0,0,0,0,0,0,0,0,0,0,0,0,0,0,0,0,0,0,0,0,0,0,0,1,1,1,1,1,2,2,2,2,2,2,3,3,3,3,5,6,6,7,7,8,10,10,12,12,14,14,15,17,19,19,29,32,32,32,33,66,66,107,107,140,174,174,213,237,275,318,375,442,533,592,592,678,778,852,930,1111,1164,1365,1526,1661,1818,1818,1964,2289,2289,2591,2728,2728,3138,3378,3628,3820,3976,3976,4346,4346,4521,4800,5026,5173,5310,5499,5714,5865,6081,6081,6242,6427,6582,6730,6879,7007,7220,7435,7740,8020,8020,8316,8580,8580,8698,8889,8889,8984,9257,9257,9257,9257,9257,9573,9573,9663,9767,9767,9894,9997,10084,10158,10204]
[null,null,"Suriname",39193,-560278,0,0,0,0,0,0,0,0,0,0,0,0,0,0,0,0,0,0,0,0,0,0,0,0,0,0,0,0,0,0,0,0,0,0,0,0,0,0,0,0,0,0,0,0,0,0,0,0,0,0,0,0,1,1,1,1,1,1,4,4,5,5,7,8,8,8,8,8,8,9,10,10,10,10,10,10,10,10,10,10,10,10,10,10,10,10,10,10,10,10,10,10,10,10,10,10,10,10,10,10,10,10,10,10,10,10,10,10,10,10,10,10,10,10,10,10,10,11,11,11,11,11,11,11,11,11,12,12,12,14,23,44,54,74,82,90,100,122,128,137,144,168,187,196,208,229,236,261,277,293,303,314,319,319,357,373,389,467,490,501,515,535,547,561,565,594,614,634,665,694,726]
[null,null,"Sweden","63.0","16.0",0,0,0,0,0,0,0,0,0,1,1,1,1,1,1,1,1,1,1,1,1,1,1,1,1,1,1,1,1,1,1,1,1,1,1,2,7,7,12,14,15,21,35,94,101,161,203,248,355,500,599,814,961,1022,1103,1190,1279,1439,1639,1763,1934,2046,2286,2526,2840,3069,3447,3700,4028,4435,4947,5568,6131,6443,6830,7206,7693,8419,9141,9685,10151,10483,10948,11445,11927,12540,13216,13822,14385,14777,15322,16004,16755,17567,18177,18640,18926,19621,20302,21092,21520,22082,22317,22721,23216,23918,24623,25265,25921,26322,26670,27272,27909,28582,29207,29677,30143,30377,30799,31523,32172,32809,33188,33459,33843,34440,35088,35727,36476,37113,37542,37814,38589,40803,41883,42939,43887,44730,45133,45924,46814,48288,49684,50931,51614,52383,53323,54562,56043,58076,58591,58848,58932,60837,62324,63890,65137,65137,65137,67667,68451,69692,70639,71419,71419,71419,73061,73344,73858,74333,74898]
[null,null,"Switzerland",468182,82275,0,0,0,0,0,0,0,0,0,0,0,0,0,0,0,0,0,0,0,0,0,0,0,0,0,0,0,0,0,0,0,0,0,0,1,1,8,8,18,27,42,56,90,114,214,268,337,374,491,652,652,1139,1359,2200,2200,2700,3028,4075,5294,6575,7474,8795,9877,10897,11811,12928,14076,14829,15922,16605,17768,18827,19606,20505,21100,21657,22253,23280,24051,24551,25107,25415,25688,25936,26336,26732,27078,27404,27740,27944,28063,28268,28496,28677,28894,29061,29164,29264,29407,29586,29705,29817,29905,29981,30009,30060,30126,30207,30251,30305,30344,30380,30413,30463,30514,30572,30587,30597,30618,30658,30694,30707,30725,30736,30746,30761,30776,30796,30828,30845,30862,30871,30874,30893,30913,30936,30956,30965,30972,30988,31011,31044,31063,31094,31117,31131,31154,31187,31200,31235,31243,31292,31310,31332,31376,31428,31486,31555,31617,31652,31714,31851,31967,32101,32198,32268,32315,32369,32498,32586,32690]
[null,null,"Taiwan*","2020-07-23","121.0",1,1,3,3,4,5,8,8,9,10,10,10,10,11,11,16,16,17,18,18,18,18,18,18,18,20,22,22,23,24,26,26,28,30,31,32,32,34,39,40,41,42,42,44,45,45,45,45,47,48,49,50,53,59,67,77,100,108,135,153,169,195,215,235,252,267,283,298,306,322,329,339,348,355,363,373,376,379,380,382,385,388,393,393,395,395,395,398,420,422,425,426,427,428,429,429,429,429,429,429,429,432,436,438,438,439,440,440,440,440,440,440,440,440,440,440,440,440,440,440,440,441,441,441,441,441,441,441,442,442,442,443,443,443,443,443,443,443,443,443,443,443,443,443,443,445,445,445,446,446,446,446,446,446,446,447,447,447,447,447,447,447,448,449,449,449,449,449,449,449,449]
[null,null,"Tanzania",-6369,348888,0,0,0,0,0,0,0,0,0,0,0,0,0,0,0,0,0,0,0,0,0,0,0,0,0,0,0,0,0,0,0,0,0,0,0,0,0,0,0,0,0,0,0,0,0,0,0,0,0,0,0,0,0,0,1,1,3,6,6,6,12,12,12,12,13,13,14,14,19,19,20,20,20,20,22,24,24,25,25,32,32,32,49,53,88,94,147,147,170,254,254,284,284,299,299,299,299,299,480,480,480,480,480,480,480,480,480,509,509,509,509,509,509,509,509,509,509,509,509,509,509,509,509,509,509,509,509,509,509,509,509,509,509,509,509,509,509,509,509,509,509,509,509,509,509,509,509,509,509,509,509,509,509,509,509,509,509,509,509,509,509,509,509,509,509,509,509,509,509,509,509]
[null,null,"Thailand","15.0","101.0",2,3,5,7,8,8,14,14,14,19,19,19,19,25,25,25,25,32,32,32,33,33,33,33,33,34,35,35,35,35,35,35,35,35,37,40,40,41,42,42,43,43,43,47,48,50,50,50,53,59,70,75,82,114,147,177,212,272,322,411,599,721,827,934,1045,1136,1245,1388,1524,1651,1771,1875,1978,2067,2169,2220,2258,2369,2423,2473,2518,2551,2579,2613,2643,2672,2700,2733,2765,2792,2811,2826,2839,2907,2907,2922,2931,2938,2947,2954,2960,2966,2969,2987,2988,2989,2992,3000,3004,3009,3015,3017,3017,3018,3025,3025,3028,3031,3033,3034,3037,3037,3040,3040,3042,3045,3054,3065,3076,3077,3081,3082,3083,3084,3101,3102,3104,3112,3119,3121,3125,3125,3129,3134,3135,3135,3135,3135,3141,3146,3147,3148,3151,3156,3158,3158,3162,3162,3162,3169,3171,3173,3179,3180,3185,3190,3195,3197,3197,3202,3202]
[null,null,"Togo",86195,"0.8248",0,0,0,0,0,0,0,0,0,0,0,0,0,0,0,0,0,0,0,0,0,0,0,0,0,0,0,0,0,0,0,0,0,0,0,0,0,0,0,0,0,0,0,0,1,1,1,1,1,1,1,1,1,1,1,1,1,1,9,16,16,18,20,23,23,25,25,25,30,34,36,39,40,41,44,58,65,70,73,76,76,76,77,77,81,81,83,84,84,84,86,88,88,90,96,98,98,99,109,116,123,123,124,126,128,128,135,145,153,174,181,199,219,238,263,298,301,330,338,340,354,363,373,381,386,391,395,422,428,433,442,443,445,452,465,485,487,495,497,501,522,524,525,530,530,531,537,544,547,555,561,569,569,576,583,588,591,615,642,643,650,661,667,671,676,680,680,689,695,704,710]
[null,null,"Trinidad and Tobago",106918,-612225,0,0,0,0,0,0,0,0,0,0,0,0,0,0,0,0,0,0,0,0,0,0,0,0,0,0,0,0,0,0,0,0,0,0,0,0,0,0,0,0,0,0,0,0,0,0,0,0,0,0,0,0,2,2,4,5,7,9,9,49,50,51,57,60,65,66,74,78,82,87,90,94,98,103,104,105,107,107,109,109,112,113,113,113,114,114,114,114,114,114,115,115,115,115,115,115,116,116,116,116,116,116,116,116,116,116,116,116,116,116,116,116,116,116,116,116,116,116,116,116,116,116,116,116,116,116,116,116,116,117,117,117,117,117,117,117,117,117,117,117,117,117,117,117,123,123,123,123,123,123,123,123,123,123,123,123,124,126,126,126,130,130,130,130,130,133,133,133,133,133,133]
[null,null,"Tunisia","34.0","9.0",0,0,0,0,0,0,0,0,0,0,0,0,0,0,0,0,0,0,0,0,0,0,0,0,0,0,0,0,0,0,0,0,0,0,0,0,0,0,0,0,0,0,1,1,1,1,2,2,5,7,7,16,18,18,20,24,29,39,54,60,75,89,114,173,197,227,278,312,312,394,423,455,495,553,574,596,623,628,643,671,685,707,726,747,780,822,864,864,879,884,884,909,918,922,939,949,967,975,980,994,998,1009,1013,1018,1022,1025,1026,1030,1032,1032,1032,1032,1032,1032,1035,1037,1037,1043,1044,1045,1046,1048,1048,1051,1051,1051,1051,1068,1071,1076,1077,1084,1086,1087,1087,1087,1087,1087,1087,1087,1087,1087,1093,1094,1096,1110,1125,1128,1132,1146,1156,1157,1159,1159,1160,1162,1164,1168,1169,1172,1174,1175,1178,1181,1186,1188,1199,1205,1221,1231,1240]
[null,null,"Turkey",389637,352433,0,0,0,0,0,0,0,0,0,0,0,0,0,0,0,0,0,0,0,0,0,0,0,0,0,0,0,0,0,0,0,0,0,0,0,0,0,0,0,0,0,0,0,0,0,0,0,0,0,1,1,5,5,6,18,47,98,192,359,670,1236,1529,1872,2433,3629,5698,7402,9217,10827,13531,15679,18135,20921,23934,27069,30217,34109,38226,42282,47029,52167,56956,61049,65111,69392,74193,78546,82329,86306,90980,95591,98674,101790,104912,107773,110130,112261,114653,117589,120204,122392,124375,126045,127659,129491,131744,133721,135569,137115,138657,139771,141475,143114,144749,146457,148067,149435,150593,151615,152587,153548,154500,155686,156827,157814,158762,159797,160979,162120,163103,163942,164769,165555,166422,167410,168340,169218,170132,171121,172114,173036,174023,175218,176677,178239,179831,181298,182727,184031,185245,186493,187685,188897,190165,191657,193115,194511,195883,197239,198613,199906,201098,202284,203456,204610,205758,206844,207897,208938,209962,210965]
[null,null,"Uganda","1.0","32.0",0,0,0,0,0,0,0,0,0,0,0,0,0,0,0,0,0,0,0,0,0,0,0,0,0,0,0,0,0,0,0,0,0,0,0,0,0,0,0,0,0,0,0,0,0,0,0,0,0,0,0,0,0,0,0,0,0,0,0,1,1,9,9,14,14,23,30,33,33,44,44,45,48,48,52,52,52,53,53,53,53,54,54,55,55,55,56,55,55,56,61,63,74,75,75,79,79,79,81,83,85,88,89,97,98,100,101,101,116,121,121,129,139,160,203,227,227,248,260,264,160,175,198,198,222,253,281,317,329,413,417,457,489,507,522,557,593,616,646,657,665,679,686,694,696,705,724,732,741,755,763,770,774,797,805,821,833,848,859,870,889,893,902,911,927,939,953,971,977,1000,1006]
[null,null,"Ukraine",483794,311656,0,0,0,0,0,0,0,0,0,0,0,0,0,0,0,0,0,0,0,0,0,0,0,0,0,0,0,0,0,0,0,0,0,0,0,0,0,0,0,0,0,1,1,1,1,1,1,1,1,1,1,3,3,3,7,14,14,16,29,47,73,73,97,145,196,310,356,475,548,645,794,897,1072,1225,1308,1319,1462,1668,1892,2203,2511,2777,3102,3372,3764,4161,4662,5106,5449,5710,6125,6592,7170,7647,8125,8617,9009,9410,9866,10406,10861,11411,11913,12331,12697,13184,13691,14195,14710,15232,15648,16023,16425,16847,17330,17858,18291,18616,18876,19230,19706,20148,20580,20986,21245,21584,21905,22382,22811,23204,23672,24562,24895,25385,25981,26542,27101,27599,28077,28479,29015,29706,30415,31177,31851,32536,33209,33986,34833,35755,36615,37361,38056,38901,39852,40854,41975,42932,43856,44538,45254,45924,46821,47705,48628,49468,50053,50622,51457,52285,53116]
[null,null,"United Arab Emirates","24.0","54.0",0,0,0,0,0,0,0,4,4,4,4,5,5,5,5,5,5,7,7,8,8,8,8,8,8,9,9,9,9,9,9,13,13,13,13,13,13,19,21,21,21,27,27,29,29,45,45,45,74,74,85,85,85,98,98,98,113,140,140,153,153,198,248,333,333,405,468,570,611,664,814,1024,1264,1505,1799,2076,2359,2659,2990,3360,3736,4123,4521,4933,5365,5825,6302,6302,6781,7265,7755,8238,8756,9281,9813,10349,10839,11380,11929,12481,13038,13599,14163,14730,15192,15738,16240,16793,17417,18198,18878,19661,20386,21084,21831,22627,23358,24190,25063,26004,26898,27892,28704,29485,30307,31086,31969,32532,33170,33896,34557,35192,35788,36359,37018,37642,38268,38808,39376,39904,40507,40986,41499,41990,42294,42636,42982,43364,43752,44145,44533,44925,45303,45683,46133,46563,46973,47360,47797,48246,48667,49069,49469,50141,50857,51540,52068,52600,53045,53577,54050]
[null,"Bermuda","United Kingdom",323078,-647505,0,0,0,0,0,0,0,0,0,0,0,0,0,0,0,0,0,0,0,0,0,0,0,0,0,0,0,0,0,0,0,0,0,0,0,0,0,0,0,0,0,0,0,0,0,0,0,0,0,0,0,0,0,0,0,0,0,2,2,2,6,6,6,7,15,17,17,22,27,32,32,35,35,35,37,39,39,39,48,48,48,57,57,57,81,81,83,83,86,86,86,99,99,99,109,109,110,110,111,114,114,114,115,115,115,118,118,118,118,118,119,121,121,122,122,123,123,125,125,125,125,128,128,133,133,139,139,140,140,140,140,141,141,141,141,141,141,141,141,141,141,141,141,142,142,144,144,144,144,146,146,146,146,146,146,146,146,146,146,146,146,146,146,146,146,146,146,148,149,149,150]
[null,"Cayman Islands","United Kingdom",193133,-812546,0,0,0,0,0,0,0,0,0,0,0,0,0,0,0,0,0,0,0,0,0,0,0,0,0,0,0,0,0,0,0,0,0,0,0,0,0,0,0,0,0,0,0,0,0,0,0,0,0,0,0,1,1,1,1,1,1,3,3,3,3,5,6,8,8,8,8,8,12,14,22,28,28,35,35,39,45,45,45,45,45,53,53,54,54,60,61,61,61,66,66,66,66,70,70,70,70,70,73,73,74,74,74,75,78,78,80,81,81,81,84,85,86,93,94,94,94,94,111,111,121,129,129,129,134,137,140,140,141,141,141,150,151,156,160,164,164,164,171,176,180,186,187,187,187,187,193,193,193,195,195,195,195,195,196,196,196,196,196,199,200,201,201,201,201,201,201,201,201,201,201]
[null,"Channel Islands","United Kingdom",493723,-23644,0,0,0,0,0,0,0,0,0,0,0,0,0,0,0,0,0,0,0,0,0,0,0,0,0,0,0,0,0,0,0,0,0,0,0,0,0,0,0,0,0,0,0,0,0,0,0,0,1,2,2,2,2,3,6,6,6,11,14,32,32,36,36,46,66,88,97,108,141,141,172,193,232,262,309,323,335,351,361,398,407,431,436,440,447,457,470,484,488,488,496,498,521,523,525,525,525,530,537,537,538,543,544,544,545,545,545,545,545,545,546,547,548,549,549,554,554,555,555,558,558,558,558,558,559,559,560,560,560,560,560,560,560,561,561,561,563,563,564,565,565,565,565,565,565,568,568,570,570,570,570,570,570,570,571,571,571,571,571,571,571,571,571,571,571,571,577,577,577,577,577]
[null,"Gibraltar","United Kingdom",361408,-53536,0,0,0,0,0,0,0,0,0,0,0,0,0,0,0,0,0,0,0,0,0,0,0,0,0,0,0,0,0,0,0,0,0,0,0,0,0,0,0,0,0,0,1,1,1,1,1,1,1,1,1,1,1,1,1,3,8,10,10,10,15,15,15,26,35,55,56,65,69,69,81,88,95,98,103,109,113,120,123,127,129,129,129,129,131,131,132,132,132,132,132,132,133,133,136,141,141,141,141,144,144,144,144,144,144,144,144,146,146,146,147,148,147,147,147,147,147,147,147,149,151,151,152,154,154,154,157,158,161,169,170,170,172,173,173,174,175,176,176,176,176,176,176,176,176,176,176,176,176,176,176,176,176,176,176,176,176,177,177,177,177,178,178,178,178,179,179,179,179,180,180]
[null,"Isle of Man","United Kingdom",542361,-45481,0,0,0,0,0,0,0,0,0,0,0,0,0,0,0,0,0,0,0,0,0,0,0,0,0,0,0,0,0,0,0,0,0,0,0,0,0,0,0,0,0,0,0,0,0,0,0,0,0,0,0,0,0,0,0,0,0,0,1,1,5,13,23,23,25,29,32,42,49,60,68,95,114,126,127,139,150,158,190,201,226,228,242,254,256,284,291,297,298,300,307,307,307,308,308,308,308,309,313,315,316,320,321,325,326,327,329,329,329,330,330,331,332,332,334,335,335,335,335,336,336,336,336,336,336,336,336,336,336,336,336,336,336,336,336,336,336,336,336,336,336,336,336,336,336,336,336,336,336,336,336,336,336,336,336,336,336,336,336,336,336,336,336,336,336,336,336,336,336,336,336]
[null,"Montserrat","United Kingdom",167425,-621874,0,0,0,0,0,0,0,0,0,0,0,0,0,0,0,0,0,0,0,0,0,0,0,0,0,0,0,0,0,0,0,0,0,0,0,0,0,0,0,0,0,0,0,0,0,0,0,0,0,0,0,0,0,0,0,0,1,1,1,1,1,1,1,1,5,5,5,5,5,5,5,5,6,6,6,6,9,9,9,9,9,9,11,11,11,11,11,11,11,11,11,11,11,11,11,11,11,11,11,11,11,11,11,11,11,11,11,11,11,11,11,11,11,11,11,11,11,11,11,11,11,11,11,11,11,11,11,11,11,11,11,11,11,11,11,11,11,11,11,11,11,11,11,11,11,11,11,11,11,11,11,11,11,11,11,11,11,11,11,11,11,11,11,11,11,11,11,11,11,11,11]
[null,null,"United Kingdom",553781,-3.436E+16,0,0,0,0,0,0,0,0,0,2,2,2,8,8,9,9,9,13,14,14,15,16,17,18,18,18,19,19,20,22,23,23,28,30,34,37,44,56,61,94,134,189,245,294,373,428,482,629,887,1298,1787,2266,2630,3072,3684,4452,5451,6506,7760,8957,10333,12668,15039,17732,20816,24017,26839,29696,33969,38484,43398,48263,53178,57198,60792,66067,71517,76646,81498,85813,89390,92885,97068,101393,106458,111756,116721,121437,125289,130147,134907,140397,145540,150513,154261,157729,162431,167152,172587,177543,182270,185491,188465,191843,195527,199358,203125,206174,208324,210645,214228,217617,220915,223524,226041,228106,229932,232506,235547,238253,240795,242825,244332,245680,247287,248937,250739,252473,253977,255076,256145,257579,259046,260388,261622,262727,263518,264235,265321,266474,267656,268657,269710,270597,271404,272430,273507,274504,275524,276504,277170,277792,278684,279566,280340,281037,281675,282308,282703,283307,283710,283770,283774,284276,284900,285416,285768,286349,286979,287621,288133]
[null,null,"Uruguay",-325228,-557658,0,0,0,0,0,0,0,0,0,0,0,0,0,0,0,0,0,0,0,0,0,0,0,0,0,0,0,0,0,0,0,0,0,0,0,0,0,0,0,0,0,0,0,0,0,0,0,0,0,0,0,4,6,8,29,50,79,94,110,135,158,162,189,217,238,274,303,309,320,338,350,369,386,400,406,415,424,456,473,494,501,480,483,492,493,502,508,517,528,535,543,549,557,563,596,606,620,625,630,643,648,652,655,657,670,673,684,694,702,707,711,717,719,724,732,733,734,737,738,746,749,753,764,769,787,789,803,811,816,821,823,825,826,828,832,834,845,845,845,846,847,847,847,847,848,848,849,849,850,853,859,876,882,885,902,907,919,924,929,932,936,943,947,952,955,956,960,965,974,977,985]
[null,null,"US",370902,-957129,1,1,2,2,5,5,5,5,5,7,8,8,11,11,11,11,11,11,11,11,12,12,13,13,13,13,13,13,13,13,15,15,15,15,15,15,16,16,24,30,53,73,104,174,222,337,451,519,711,1109,1561,2157,2870,2968,4360,6141,8917,14157,19479,25825,33761,43850,54112,66055,84091,102276,122069,141205,162707,188724,214205,244610,276547,309699,337573,367215,397992,429686,464442,497943,527969,556522,581813,608878,637974,669272,701996,730337,756375,783716,809228,837422,871617,907908,940829,968518,990999,1015518,1042926,1072667,1106829,1136024,1161611,1184086,1208271,1233527,1261409,1288587,1314320,1334084,1352962,1374916,1396109,1423726,1449026,1474127,1493131,1514900,1535349,1558970,1584511,1608652,1630475,1651288,1670279,1689162,1707444,1730259,1754763,1778993,1799122,1816476,1837371,1857329,1878680,1903904,1926636,1944367,1961781,1979908,2000702,2023652,2048986,2074542,2094366,2114026,2137731,2163290,2191099,2222579,2255327,2281766,2312302,2347491,2382426,2422299,2467554,2510259,2549294,2590668,2636414,2687588,2742049,2795361,2841241,2891124,2936077,2996098,3054699,3117946,3184573]
[null,null,"Uzbekistan",413775,645853,0,0,0,0,0,0,0,0,0,0,0,0,0,0,0,0,0,0,0,0,0,0,0,0,0,0,0,0,0,0,0,0,0,0,0,0,0,0,0,0,0,0,0,0,0,0,0,0,0,0,0,0,0,1,6,10,15,23,33,43,43,46,50,60,75,88,104,144,149,172,181,205,227,266,342,457,520,545,582,624,767,865,998,1165,1302,1349,1405,1490,1565,1627,1678,1716,1758,1804,1862,1869,1904,1939,2002,2039,2086,2118,2149,2189,2207,2233,2298,2325,2349,2418,2486,2519,2612,2645,2686,2738,2753,2791,2855,2939,2964,3028,3115,3164,3189,3290,3369,3444,3468,3546,3623,3702,3760,3843,3939,4007,4094,4331,4440,4520,4623,4741,4869,4966,5080,5263,5493,5682,5767,5946,6153,6315,6461,6662,6990,7177,7427,7682,7948,8222,8503,8781,9078,9396,9708,10020,10362,10838,11092,11564,12027]
[null,null,"Venezuela",64238,-665897,0,0,0,0,0,0,0,0,0,0,0,0,0,0,0,0,0,0,0,0,0,0,0,0,0,0,0,0,0,0,0,0,0,0,0,0,0,0,0,0,0,0,0,0,0,0,0,0,0,0,0,0,2,10,17,33,36,42,42,70,70,77,84,91,107,107,119,119,135,135,143,146,153,155,159,165,165,167,171,171,175,181,189,189,197,204,204,227,256,256,285,288,311,318,323,325,329,329,331,333,335,345,357,357,361,379,381,388,402,414,422,423,423,455,459,504,541,618,749,824,882,944,1010,1121,1177,1211,1245,1325,1370,1459,1510,1662,1819,1952,2087,2145,2316,2377,2473,2632,2738,2814,2879,2904,2978,3062,3150,3386,3483,3591,3789,3917,4048,4187,4366,4563,4779,5130,5297,5530,5832,6062,6273,6537,6750,7169,7411,7693,8008,8372,8803]
[null,null,"Vietnam","16.0","108.0",0,2,2,2,2,2,2,2,2,2,6,6,8,8,8,10,10,13,13,14,15,15,16,16,16,16,16,16,16,16,16,16,16,16,16,16,16,16,16,16,16,16,16,16,16,18,30,30,31,38,39,47,53,56,61,66,75,85,91,94,113,123,134,141,153,163,174,188,203,212,218,233,237,240,241,245,249,251,255,257,258,262,265,266,267,268,268,268,268,268,268,268,268,270,270,270,270,270,270,270,270,270,271,271,271,271,288,288,288,288,288,288,288,312,314,318,320,324,324,324,324,324,325,325,326,327,327,327,328,328,328,328,328,328,328,328,329,331,332,332,332,332,333,334,334,334,334,335,342,349,349,349,349,349,352,352,353,355,355,355,355,355,355,355,355,355,369,369,369,369,370]
[null,null,"Zambia",-154167,282833,0,0,0,0,0,0,0,0,0,0,0,0,0,0,0,0,0,0,0,0,0,0,0,0,0,0,0,0,0,0,0,0,0,0,0,0,0,0,0,0,0,0,0,0,0,0,0,0,0,0,0,0,0,0,0,0,2,2,2,2,3,3,3,12,16,22,28,29,35,35,36,39,39,39,39,39,39,39,39,40,40,43,45,45,48,48,52,57,61,65,70,74,76,84,84,88,88,95,97,106,109,119,124,137,138,146,153,167,252,267,267,441,446,654,654,679,753,761,772,832,866,920,920,920,920,920,1057,1057,1057,1057,1057,1089,1089,1089,1089,1089,1089,1089,1200,1200,1200,1200,1321,1357,1358,1382,1405,1412,1416,1430,1430,1430,1430,1477,1489,1497,1531,1531,1557,1568,1594,1632,1632,1632,1632,1632,1632,1895,1895,1895,1895]
[null,null,"Zimbabwe","-20.0","30.0",0,0,0,0,0,0,0,0,0,0,0,0,0,0,0,0,0,0,0,0,0,0,0,0,0,0,0,0,0,0,0,0,0,0,0,0,0,0,0,0,0,0,0,0,0,0,0,0,0,0,0,0,0,0,0,0,0,0,1,3,3,3,3,3,3,5,7,7,7,8,8,9,9,9,9,10,11,11,11,13,14,14,17,17,23,23,24,25,25,25,28,28,28,29,31,31,32,32,32,40,40,34,34,34,34,34,34,34,35,36,36,36,37,37,42,42,44,46,46,48,51,51,56,56,56,56,132,149,149,174,178,203,206,222,237,265,279,282,287,314,320,332,343,356,383,387,391,401,463,479,479,489,512,525,530,551,561,567,567,574,591,605,617,625,698,716,734,787,885,885,942]
[null,"Diamond Princess","Canada","0.0","0.0",0,0,0,0,0,0,0,0,0,0,0,0,0,0,0,0,0,0,0,0,0,0,0,0,0,0,0,0,0,0,0,0,0,0,0,0,0,0,0,0,0,0,0,0,0,0,0,0,0,0,0,0,0,0,0,0,0,0,0,0,0,0,0,0,0,0,0,0,0,0,0,0,0,0,0,0,0,0,0,0,0,0,0,0,0,0,0,0,0,0,0,0,0,0,0,0,0,0,0,0,1,1,1,1,1,1,1,1,1,1,1,1,1,1,1,1,1,1,1,1,1,1,1,1,1,1,1,1,1,1,1,1,0,0,0,0,0,0,0,0,0,0,0,0,0,0,0,0,0,0,0,0,0,0,0,0,0,0,0,0,0,0,0,0,0,0,0,0,0,0,0]
[null,null,"Dominica",15415,-61371,0,0,0,0,0,0,0,0,0,0,0,0,0,0,0,0,0,0,0,0,0,0,0,0,0,0,0,0,0,0,0,0,0,0,0,0,0,0,0,0,0,0,0,0,0,0,0,0,0,0,0,0,0,0,0,0,0,0,0,0,1,2,2,7,11,11,11,11,11,12,12,12,12,14,14,15,15,15,15,16,16,16,16,16,16,16,16,16,16,16,16,16,16,16,16,16,16,16,16,16,16,16,16,16,16,16,16,16,16,16,16,16,16,16,16,16,16,16,16,16,16,16,16,16,16,16,16,16,16,16,16,16,18,18,18,18,18,18,18,18,18,18,18,18,18,18,18,18,18,18,18,18,18,18,18,18,18,18,18,18,18,18,18,18,18,18,18,18,18,18,18]
[null,null,"Grenada",121165,-6.1678999999999904E+16,0,0,0,0,0,0,0,0,0,0,0,0,0,0,0,0,0,0,0,0,0,0,0,0,0,0,0,0,0,0,0,0,0,0,0,0,0,0,0,0,0,0,0,0,0,0,0,0,0,0,0,0,0,0,0,0,0,0,0,0,1,1,1,1,7,7,7,9,9,9,9,10,12,12,12,12,12,12,12,14,14,14,14,14,14,14,14,14,14,14,14,15,15,15,18,18,18,19,20,20,20,21,21,21,21,21,21,21,21,21,21,21,21,21,22,22,22,22,22,22,22,22,22,22,23,23,23,23,23,23,23,23,23,23,23,23,23,23,23,23,23,23,23,23,23,23,23,23,23,23,23,23,23,23,23,23,23,23,23,23,23,23,23,23,23,23,23,23,23,23,23]
[null,null,"Mozambique",-18665695,35529562,0,0,0,0,0,0,0,0,0,0,0,0,0,0,0,0,0,0,0,0,0,0,0,0,0,0,0,0,0,0,0,0,0,0,0,0,0,0,0,0,0,0,0,0,0,0,0,0,0,0,0,0,0,0,0,0,0,0,0,0,1,1,3,5,7,7,8,8,8,8,10,10,10,10,10,10,10,17,17,20,20,21,21,28,29,31,34,35,39,39,39,41,46,65,70,76,76,76,76,76,79,79,80,80,81,81,81,82,87,91,103,104,104,115,119,129,137,145,146,156,162,164,168,194,209,213,227,233,234,244,254,254,307,316,352,354,409,424,433,453,472,489,509,553,583,609,638,651,662,668,688,733,737,757,762,788,816,839,859,883,889,903,918,939,969,987,1012,1040,1071,1092,1111]
[null,null,"Syria",34802075,3899681500000000,0,0,0,0,0,0,0,0,0,0,0,0,0,0,0,0,0,0,0,0,0,0,0,0,0,0,0,0,0,0,0,0,0,0,0,0,0,0,0,0,0,0,0,0,0,0,0,0,0,0,0,0,0,0,0,0,0,0,0,0,1,1,1,5,5,5,5,9,10,10,10,16,16,16,19,19,19,19,19,19,25,25,25,29,33,33,38,38,39,39,42,42,42,42,42,43,43,43,43,43,44,44,44,44,44,45,45,47,47,47,47,47,48,48,50,51,58,58,58,58,58,59,70,86,106,121,121,122,122,122,122,123,123,123,124,124,125,141,144,146,152,164,164,170,177,177,177,178,187,187,198,204,219,231,231,242,255,256,256,269,279,293,312,328,338,358,372,372,372,372,394]
[null,null,"Timor-Leste",-8874217,125727539,0,0,0,0,0,0,0,0,0,0,0,0,0,0,0,0,0,0,0,0,0,0,0,0,0,0,0,0,0,0,0,0,0,0,0,0,0,0,0,0,0,0,0,0,0,0,0,0,0,0,0,0,0,0,0,0,0,0,0,0,1,1,1,1,1,1,1,1,1,1,1,1,1,1,1,1,1,1,1,2,2,2,4,6,8,18,18,18,19,22,23,23,23,24,24,24,24,24,24,24,24,24,24,24,24,24,24,24,24,24,24,24,24,24,24,24,24,24,24,24,24,24,24,24,24,24,24,24,24,24,24,24,24,24,24,24,24,24,24,24,24,24,24,24,24,24,24,24,24,24,24,24,24,24,24,24,24,24,24,24,24,24,24,24,24,24,24,24,24,24,24]
[null,null,"Belize",131939,-595432,0,0,0,0,0,0,0,0,0,0,0,0,0,0,0,0,0,0,0,0,0,0,0,0,0,0,0,0,0,0,0,0,0,0,0,0,0,0,0,0,0,0,0,0,0,0,0,0,0,0,0,0,0,0,0,0,0,0,0,0,0,1,1,2,2,2,2,2,3,3,3,3,4,4,5,7,7,8,9,10,13,14,18,18,18,18,18,18,18,18,18,18,18,18,18,18,18,18,18,18,18,18,18,18,18,18,18,18,18,18,18,18,18,18,18,18,18,18,18,18,18,18,18,18,18,18,18,18,18,18,18,18,18,18,18,19,19,19,19,20,20,20,20,20,20,21,22,22,22,22,22,22,23,23,23,23,24,24,24,24,24,28,28,30,30,30,30,30,30,30,37]
[null,null,"Laos",1.985627E+16,102495496,0,0,0,0,0,0,0,0,0,0,0,0,0,0,0,0,0,0,0,0,0,0,0,0,0,0,0,0,0,0,0,0,0,0,0,0,0,0,0,0,0,0,0,0,0,0,0,0,0,0,0,0,0,0,0,0,0,0,0,0,0,0,2,3,6,6,8,8,8,9,10,10,10,10,11,12,14,15,16,16,18,19,19,19,19,19,19,19,19,19,19,19,19,19,19,19,19,19,19,19,19,19,19,19,19,19,19,19,19,19,19,19,19,19,19,19,19,19,19,19,19,19,19,19,19,19,19,19,19,19,19,19,19,19,19,19,19,19,19,19,19,19,19,19,19,19,19,19,19,19,19,19,19,19,19,19,19,19,19,19,19,19,19,19,19,19,19,19,19,19,19]
[null,null,"Libya",263351,17228331,0,0,0,0,0,0,0,0,0,0,0,0,0,0,0,0,0,0,0,0,0,0,0,0,0,0,0,0,0,0,0,0,0,0,0,0,0,0,0,0,0,0,0,0,0,0,0,0,0,0,0,0,0,0,0,0,0,0,0,0,0,0,1,1,1,1,3,8,8,10,10,11,11,18,18,19,20,21,24,24,24,25,26,35,48,49,49,49,51,51,51,59,60,61,61,61,61,61,61,61,63,63,63,63,63,64,64,64,64,64,64,64,64,64,64,65,65,65,68,69,71,72,75,75,75,77,99,105,118,130,156,168,182,196,209,239,256,256,332,359,378,393,409,418,454,467,484,500,510,520,544,571,595,639,670,698,713,727,762,802,824,874,891,918,989,1046,1117,1182,1268,1342,1342]
[null,null,"West Bank and Gaza",319522,352332,0,0,0,0,0,0,0,0,0,0,0,0,0,0,0,0,0,0,0,0,0,0,0,0,0,0,0,0,0,0,0,0,0,0,0,0,0,0,0,0,0,0,0,4,7,16,16,19,26,30,30,31,35,38,38,39,41,44,47,48,52,59,59,59,84,91,98,109,116,119,134,161,194,217,237,254,261,263,263,267,268,271,273,284,291,294,307,313,319,329,329,335,336,340,342,342,342,343,344,344,353,353,353,362,371,374,375,375,375,375,375,375,375,375,375,376,381,388,391,398,423,423,423,423,423,429,434,446,446,447,448,449,451,457,464,464,464,472,473,481,485,487,489,489,492,505,514,555,600,675,784,833,1001,1169,1328,1382,1557,1815,1990,2185,2428,2758,3080,3334,3835,4277,4341,4647,5029,5220,5551]
[null,null,"Guinea-Bissau",118037,-151804,0,0,0,0,0,0,0,0,0,0,0,0,0,0,0,0,0,0,0,0,0,0,0,0,0,0,0,0,0,0,0,0,0,0,0,0,0,0,0,0,0,0,0,0,0,0,0,0,0,0,0,0,0,0,0,0,0,0,0,0,0,0,0,2,2,2,2,2,8,8,9,9,15,18,18,18,33,33,36,36,38,38,38,38,43,43,43,46,50,50,50,50,50,52,52,53,73,73,205,205,257,257,257,413,413,475,564,594,641,726,761,820,836,913,913,969,990,1032,1038,1089,1109,1114,1114,1114,1178,1178,1195,1195,1256,1256,1256,1339,1339,1339,1339,1368,1368,1368,1389,1389,1389,1389,1460,1460,1460,1492,1492,1492,1492,1541,1541,1541,1556,1556,1556,1556,1614,1614,1614,1654,1654,1654,1654,1765,1765,1765,1790,1790,1790,1790,1842]
[null,null,"Mali",17570692,-3996166000000000,0,0,0,0,0,0,0,0,0,0,0,0,0,0,0,0,0,0,0,0,0,0,0,0,0,0,0,0,0,0,0,0,0,0,0,0,0,0,0,0,0,0,0,0,0,0,0,0,0,0,0,0,0,0,0,0,0,0,0,0,0,0,0,2,4,11,18,18,25,28,31,36,39,41,45,47,56,59,74,87,87,105,123,144,148,171,171,216,224,246,258,293,309,325,370,389,408,424,482,490,508,544,563,580,612,631,650,668,692,704,712,730,758,779,806,835,860,874,901,931,947,969,1015,1030,1059,1077,1116,1194,1226,1250,1265,1315,1351,1386,1461,1485,1523,1533,1547,1586,1667,1722,1752,1776,1809,1860,1885,1890,1906,1923,1933,1933,1961,1978,2005,2039,2060,2118,2147,2173,2181,2202,2260,2285,2303,2330,2331,2348,2358,2370,2404]
[null,null,"Saint Kitts and Nevis",17357822,-62782998,0,0,0,0,0,0,0,0,0,0,0,0,0,0,0,0,0,0,0,0,0,0,0,0,0,0,0,0,0,0,0,0,0,0,0,0,0,0,0,0,0,0,0,0,0,0,0,0,0,0,0,0,0,0,0,0,0,0,0,0,0,0,0,2,2,2,2,2,7,8,8,9,9,9,10,10,11,11,11,12,12,12,12,14,14,14,14,14,14,15,15,15,15,15,15,15,15,15,15,15,15,15,15,15,15,15,15,15,15,15,15,15,15,15,15,15,15,15,15,15,15,15,15,15,15,15,15,15,15,15,15,15,15,15,15,15,15,15,15,15,15,15,15,15,15,15,15,15,15,15,15,15,15,15,15,15,15,15,15,15,15,15,15,15,16,16,16,16,16,16,17]
[null,"Northwest Territories","Canada",648255,-1248457,0,0,0,0,0,0,0,0,0,0,0,0,0,0,0,0,0,0,0,0,0,0,0,0,0,0,0,0,0,0,0,0,0,0,0,0,0,0,0,0,0,0,0,0,0,0,0,0,0,0,0,0,0,0,0,0,0,0,0,0,0,0,0,0,1,1,1,1,1,1,2,2,2,4,4,5,5,5,5,5,5,5,5,5,5,5,5,5,5,5,5,5,5,5,5,5,5,5,5,5,5,5,5,5,5,5,5,5,5,5,5,5,5,5,5,5,5,5,5,5,5,5,5,5,5,5,5,5,5,5,5,5,5,5,5,5,5,5,5,5,5,5,5,5,5,5,5,5,5,5,5,5,5,5,5,5,5,5,5,5,5,5,5,5,5,5,5,5,5,5,5]
[null,"Yukon","Canada",642823,"-135.0",0,0,0,0,0,0,0,0,0,0,0,0,0,0,0,0,0,0,0,0,0,0,0,0,0,0,0,0,0,0,0,0,0,0,0,0,0,0,0,0,0,0,0,0,0,0,0,0,0,0,0,0,0,0,0,0,0,0,0,0,0,0,0,0,3,3,4,4,4,5,5,6,6,6,6,6,7,7,7,8,8,8,8,8,8,8,8,9,9,11,11,11,11,11,11,11,11,11,11,11,11,11,11,11,11,11,11,11,11,11,11,11,11,11,11,11,11,11,11,11,11,11,11,11,11,11,11,11,11,11,11,11,11,11,11,11,11,11,11,11,11,11,11,11,11,11,11,11,11,11,11,11,11,11,11,11,11,11,11,11,11,11,11,11,11,11,11,11,11,11,11]
[null,null,"Kosovo",42602636,20902977,0,0,0,0,0,0,0,0,0,0,0,0,0,0,0,0,0,0,0,0,0,0,0,0,0,0,0,0,0,0,0,0,0,0,0,0,0,0,0,0,0,0,0,0,0,0,0,0,0,0,0,0,0,0,0,0,0,0,0,0,0,0,0,0,71,86,91,94,94,112,125,125,126,135,145,145,170,184,184,250,283,283,283,387,387,449,480,510,561,598,604,630,669,703,731,763,780,790,799,806,806,823,851,855,856,856,861,861,862,870,884,919,919,944,944,944,955,955,989,989,1003,1004,1025,1032,1038,1038,1047,1048,1048,1064,1064,1064,1064,1142,1142,1142,1142,1142,1263,1263,1298,1326,1326,1437,1437,1486,1486,1486,1486,1486,1486,1486,2169,2169,2169,2169,2169,2169,2169,2677,2878,2991,3064,3064,3064,3356,3508,3703,3886,4100,4307]
[null,null,"Burma",219162,95956,0,0,0,0,0,0,0,0,0,0,0,0,0,0,0,0,0,0,0,0,0,0,0,0,0,0,0,0,0,0,0,0,0,0,0,0,0,0,0,0,0,0,0,0,0,0,0,0,0,0,0,0,0,0,0,0,0,0,0,0,0,0,0,0,0,8,8,10,14,15,15,20,20,21,21,22,22,22,23,27,38,41,62,63,74,85,88,98,111,119,121,123,139,144,146,146,146,150,150,151,151,151,155,161,161,161,176,177,178,180,180,180,181,181,182,182,184,191,193,199,199,199,201,201,203,206,206,206,207,224,224,228,232,233,236,236,240,242,244,246,248,260,261,261,261,262,262,262,286,286,287,290,291,292,293,293,293,296,299,299,299,303,304,306,313,313,316,316,317,321,326]
[null,"Anguilla","United Kingdom",182206,-630686,0,0,0,0,0,0,0,0,0,0,0,0,0,0,0,0,0,0,0,0,0,0,0,0,0,0,0,0,0,0,0,0,0,0,0,0,0,0,0,0,0,0,0,0,0,0,0,0,0,0,0,0,0,0,0,0,0,0,0,0,0,0,0,0,0,0,2,2,2,2,2,3,3,3,3,3,3,3,3,3,3,3,3,3,3,3,3,3,3,3,3,3,3,3,3,3,3,3,3,3,3,3,3,3,3,3,3,3,3,3,3,3,3,3,3,3,3,3,3,3,3,3,3,3,3,3,3,3,3,3,3,3,3,3,3,3,3,3,3,3,3,3,3,3,3,3,3,3,3,3,3,3,3,3,3,3,3,3,3,3,3,3,3,3,3,3,3,3,3,3,3]
[null,"British Virgin Islands","United Kingdom",184207,"-64.64",0,0,0,0,0,0,0,0,0,0,0,0,0,0,0,0,0,0,0,0,0,0,0,0,0,0,0,0,0,0,0,0,0,0,0,0,0,0,0,0,0,0,0,0,0,0,0,0,0,0,0,0,0,0,0,0,0,0,0,0,0,0,0,0,0,0,2,2,2,3,3,3,3,3,3,3,3,3,3,3,3,3,3,3,3,3,4,4,4,5,5,5,5,5,6,6,6,6,6,6,6,6,6,6,6,7,7,7,7,7,7,7,7,7,8,8,8,8,8,8,8,8,8,8,8,8,8,8,8,8,8,8,8,8,8,8,8,8,8,8,8,8,8,8,8,8,8,8,8,8,8,8,8,8,8,8,8,8,8,8,8,8,8,8,8,8,8,8,8,8,8]
[null,"Turks and Caicos Islands","United Kingdom",2169400000000000,-717979,0,0,0,0,0,0,0,0,0,0,0,0,0,0,0,0,0,0,0,0,0,0,0,0,0,0,0,0,0,0,0,0,0,0,0,0,0,0,0,0,0,0,0,0,0,0,0,0,0,0,0,0,0,0,0,0,0,0,0,0,0,0,0,0,0,0,4,4,5,5,6,5,5,5,5,8,8,8,8,8,8,9,10,10,10,11,11,11,11,11,11,11,11,11,11,11,12,12,12,12,12,12,12,12,12,12,12,12,12,12,12,12,12,12,12,12,12,12,12,12,12,12,12,12,12,12,12,12,12,12,12,12,12,12,12,12,12,12,12,12,12,12,12,12,12,12,12,12,12,12,12,14,14,14,15,15,16,16,28,41,41,42,44,44,45,47,48,49,55,55,66]
[null,null,"MS Zaandam","0.0","0.0",0,0,0,0,0,0,0,0,0,0,0,0,0,0,0,0,0,0,0,0,0,0,0,0,0,0,0,0,0,0,0,0,0,0,0,0,0,0,0,0,0,0,0,0,0,0,0,0,0,0,0,0,0,0,0,0,0,0,0,0,0,0,0,0,0,0,2,2,2,2,9,9,9,9,9,9,9,9,9,9,9,9,9,9,9,9,9,9,9,9,9,9,9,9,9,9,9,9,9,9,9,9,9,9,9,9,9,9,9,9,9,9,9,9,9,9,9,9,9,9,9,9,9,9,9,9,9,9,9,9,9,9,9,9,9,9,9,9,9,9,9,9,9,9,9,9,9,9,9,9,9,9,9,9,9,9,9,9,9,9,9,9,9,9,9,9,9,9,9,9,9]
[null,null,"Botswana",-223285,246849,0,0,0,0,0,0,0,0,0,0,0,0,0,0,0,0,0,0,0,0,0,0,0,0,0,0,0,0,0,0,0,0,0,0,0,0,0,0,0,0,0,0,0,0,0,0,0,0,0,0,0,0,0,0,0,0,0,0,0,0,0,0,0,0,0,0,0,0,3,4,4,4,4,4,6,6,6,6,13,13,13,13,13,13,13,15,15,15,20,20,20,22,22,22,22,22,22,23,23,23,23,23,23,23,23,23,23,23,23,23,24,24,24,24,24,24,25,25,25,25,29,30,30,35,35,35,35,35,35,35,35,38,40,40,40,40,40,40,42,42,48,48,48,60,60,60,60,79,79,89,89,89,89,89,92,92,92,92,92,175,227,227,227,277,277,277,314,314,314,314,314]
[null,null,"Burundi",-33731,299189,0,0,0,0,0,0,0,0,0,0,0,0,0,0,0,0,0,0,0,0,0,0,0,0,0,0,0,0,0,0,0,0,0,0,0,0,0,0,0,0,0,0,0,0,0,0,0,0,0,0,0,0,0,0,0,0,0,0,0,0,0,0,0,0,0,0,0,0,0,2,2,3,3,3,3,3,3,3,3,3,5,5,5,5,5,5,5,5,5,5,5,11,11,11,11,11,11,11,11,11,11,15,15,15,15,15,15,15,15,15,15,15,15,15,15,15,23,42,42,42,42,42,42,42,42,42,42,42,42,63,63,63,63,63,63,63,83,83,83,83,83,85,85,85,85,85,104,104,104,104,104,144,144,144,144,144,144,170,170,170,170,170,170,191,191,191,191,191,191,191,191]
[null,null,"Sierra Leone",8460555000000000,-11779889,0,0,0,0,0,0,0,0,0,0,0,0,0,0,0,0,0,0,0,0,0,0,0,0,0,0,0,0,0,0,0,0,0,0,0,0,0,0,0,0,0,0,0,0,0,0,0,0,0,0,0,0,0,0,0,0,0,0,0,0,0,0,0,0,0,0,0,0,0,1,2,2,2,4,6,6,6,7,7,8,8,10,10,11,13,15,26,30,35,43,50,61,64,82,82,93,93,104,104,124,136,155,166,178,199,225,231,257,291,307,338,338,387,408,447,462,505,519,534,570,585,606,621,707,735,754,782,812,829,852,861,865,896,909,914,929,946,969,1001,1025,1062,1085,1103,1132,1169,1176,1225,1249,1272,1298,1309,1327,1340,1347,1354,1354,1394,1410,1427,1450,1462,1498,1518,1524,1533,1542,1547,1572,1584,1598,1613]
[null,"Bonaire, Sint Eustatius and Saba","Netherlands",121784,-682385,0,0,0,0,0,0,0,0,0,0,0,0,0,0,0,0,0,0,0,0,0,0,0,0,0,0,0,0,0,0,0,0,0,0,0,0,0,0,0,0,0,0,0,0,0,0,0,0,0,0,0,0,0,0,0,0,0,0,0,0,0,0,0,0,0,0,0,0,0,0,0,2,2,2,2,2,2,2,2,2,2,3,3,3,3,3,3,3,5,5,5,5,5,5,5,5,5,5,5,5,6,6,6,6,6,6,6,6,6,6,6,6,6,6,6,6,6,6,6,6,6,6,6,6,6,6,6,6,6,6,6,7,7,7,7,7,7,7,7,7,7,7,7,7,7,7,7,7,7,7,7,7,7,7,7,7,7,7,7,7,7,7,7,7,7,7,7,7,7,7,7]
[null,null,"Malawi",-1.32543079999999E+16,34301525,0,0,0,0,0,0,0,0,0,0,0,0,0,0,0,0,0,0,0,0,0,0,0,0,0,0,0,0,0,0,0,0,0,0,0,0,0,0,0,0,0,0,0,0,0,0,0,0,0,0,0,0,0,0,0,0,0,0,0,0,0,0,0,0,0,0,0,0,0,0,0,3,3,4,4,5,8,8,8,9,12,13,16,16,16,16,17,17,17,17,18,23,33,33,33,34,36,36,36,37,37,38,39,41,41,43,43,43,56,56,57,57,63,63,63,65,70,70,70,71,72,82,82,83,101,101,101,203,273,279,284,336,358,369,393,409,409,438,443,455,455,481,481,529,547,555,564,572,592,620,620,730,749,803,941,960,1005,1038,1146,1152,1224,1265,1342,1498,1613,1613,1742,1818,1864,1942,2069]
[null,"Falkland Islands (Malvinas)","United Kingdom",-517963,-595236,0,0,0,0,0,0,0,0,0,0,0,0,0,0,0,0,0,0,0,0,0,0,0,0,0,0,0,0,0,0,0,0,0,0,0,0,0,0,0,0,0,0,0,0,0,0,0,0,0,0,0,0,0,0,0,0,0,0,0,0,0,0,0,0,0,0,0,0,0,0,0,0,0,1,2,2,2,5,5,5,5,5,5,11,11,11,11,11,11,11,11,11,12,13,13,13,13,13,13,13,13,13,13,13,13,13,13,13,13,13,13,13,13,13,13,13,13,13,13,13,13,13,13,13,13,13,13,13,13,13,13,13,13,13,13,13,13,13,13,13,13,13,13,13,13,13,13,13,13,13,13,13,13,13,13,13,13,13,13,13,13,13,13,13,13,13,13,13,13,13,13]
[null,"Saint Pierre and Miquelon","France",468852,-563159,0,0,0,0,0,0,0,0,0,0,0,0,0,0,0,0,0,0,0,0,0,0,0,0,0,0,0,0,0,0,0,0,0,0,0,0,0,0,0,0,0,0,0,0,0,0,0,0,0,0,0,0,0,0,0,0,0,0,0,0,0,0,0,0,0,0,0,0,0,0,0,0,0,0,1,1,1,1,1,1,1,1,1,1,1,1,1,1,1,1,1,1,1,1,1,1,1,1,1,1,1,1,1,1,1,1,1,1,1,1,1,1,1,1,1,1,1,1,1,1,1,1,1,1,1,1,1,1,1,1,1,1,1,1,1,1,1,1,1,1,1,1,1,1,1,1,1,1,1,1,1,1,1,1,1,1,1,1,1,1,1,1,1,1,1,1,1,1,1,1,2]
[null,null,"South Sudan",6.877E+16,31307,0,0,0,0,0,0,0,0,0,0,0,0,0,0,0,0,0,0,0,0,0,0,0,0,0,0,0,0,0,0,0,0,0,0,0,0,0,0,0,0,0,0,0,0,0,0,0,0,0,0,0,0,0,0,0,0,0,0,0,0,0,0,0,0,0,0,0,0,0,0,0,0,0,0,1,1,2,2,3,4,4,4,4,4,4,4,4,4,4,4,4,4,5,5,5,6,6,34,34,35,45,45,46,46,52,58,74,120,120,120,156,194,203,203,236,236,290,290,290,290,481,563,655,655,806,806,994,994,994,994,994,994,994,994,994,994,994,1317,1604,1604,1604,1670,1670,1693,1693,1693,1776,1813,1830,1864,1882,1892,1916,1930,1942,1942,1942,1942,1989,1989,2007,2021,2021,2021,2021,2021,2021,2021,2021,2021,2021]
[null,null,"Western Sahara",242155,-128858,0,0,0,0,0,0,0,0,0,0,0,0,0,0,0,0,0,0,0,0,0,0,0,0,0,0,0,0,0,0,0,0,0,0,0,0,0,0,0,0,0,0,0,0,0,0,0,0,0,0,0,0,0,0,0,0,0,0,0,0,0,0,0,0,0,0,0,0,0,0,0,0,0,0,4,4,4,4,4,4,4,6,6,6,6,6,6,6,6,6,6,6,6,6,6,6,6,6,6,6,6,6,6,6,6,6,6,6,6,6,6,6,6,6,6,6,6,6,6,6,6,6,6,9,9,9,9,9,9,9,9,9,9,9,9,9,9,9,9,9,9,9,9,9,9,9,9,9,9,9,9,9,10,10,10,10,10,10,10,10,10,10,10,10,10,10,10,10,10,10,10]
[null,null,"Sao Tome and Principe","0.18636",6613081,0,0,0,0,0,0,0,0,0,0,0,0,0,0,0,0,0,0,0,0,0,0,0,0,0,0,0,0,0,0,0,0,0,0,0,0,0,0,0,0,0,0,0,0,0,0,0,0,0,0,0,0,0,0,0,0,0,0,0,0,0,0,0,0,0,0,0,0,0,0,0,0,0,0,0,4,4,4,4,4,4,4,4,4,4,4,4,4,4,4,4,4,4,4,4,4,4,8,8,14,16,16,16,23,174,174,187,208,208,208,208,208,220,235,235,235,235,246,251,251,251,251,251,251,299,441,443,458,463,479,483,484,484,484,485,499,499,513,513,514,611,632,639,659,661,662,671,683,688,693,698,698,702,707,710,711,712,713,713,713,714,715,717,719,719,720,721,724,724,726,727]
[null,null,"Yemen",1.55527269999999E+16,48516388,0,0,0,0,0,0,0,0,0,0,0,0,0,0,0,0,0,0,0,0,0,0,0,0,0,0,0,0,0,0,0,0,0,0,0,0,0,0,0,0,0,0,0,0,0,0,0,0,0,0,0,0,0,0,0,0,0,0,0,0,0,0,0,0,0,0,0,0,0,0,0,0,0,0,0,0,0,0,0,1,1,1,1,1,1,1,1,1,1,1,1,1,1,1,1,1,1,1,6,6,7,10,10,12,22,25,25,34,34,51,56,65,70,85,106,122,128,130,167,184,197,209,212,222,233,249,256,278,283,310,323,354,399,419,453,469,482,484,496,524,560,591,632,705,728,844,885,902,909,919,922,941,967,992,1015,1076,1089,1103,1118,1128,1158,1190,1221,1240,1248,1265,1284,1297,1318,1356,1380]
[null,null,"Comoros",-116455,433333,0,0,0,0,0,0,0,0,0,0,0,0,0,0,0,0,0,0,0,0,0,0,0,0,0,0,0,0,0,0,0,0,0,0,0,0,0,0,0,0,0,0,0,0,0,0,0,0,0,0,0,0,0,0,0,0,0,0,0,0,0,0,0,0,0,0,0,0,0,0,0,0,0,0,0,0,0,0,0,0,0,0,0,0,0,0,0,0,0,0,0,0,0,0,0,0,0,0,0,1,1,3,3,3,3,8,8,8,11,11,11,11,11,11,11,11,11,11,11,34,34,78,78,87,87,87,87,87,87,106,106,106,132,132,132,132,141,141,141,141,162,162,163,176,176,176,197,197,210,210,247,247,247,265,265,272,272,272,272,272,303,303,303,309,309,311,311,311,313,314,314]
[null,null,"Tajikistan",3.8861034E+16,71276093,0,0,0,0,0,0,0,0,0,0,0,0,0,0,0,0,0,0,0,0,0,0,0,0,0,0,0,0,0,0,0,0,0,0,0,0,0,0,0,0,0,0,0,0,0,0,0,0,0,0,0,0,0,0,0,0,0,0,0,0,0,0,0,0,0,0,0,0,0,0,0,0,0,0,0,0,0,0,0,0,0,0,0,0,0,0,0,0,0,0,0,0,0,0,0,0,0,0,0,15,15,76,128,230,293,379,461,522,612,612,661,729,801,907,1118,1322,1524,1729,1936,2140,2350,2551,2738,2929,3100,3266,3424,3563,3686,3807,3930,4013,4100,4191,4289,4370,4453,4529,4609,4690,4763,4834,4902,4971,5035,5097,5160,5221,5279,5338,5399,5457,5513,5567,5630,5691,5747,5799,5849,5900,5900,6005,6058,6058,6159,6213,6262,6315,6364,6410,6457]
[null,null,"Lesotho",-29609988,28233608,0,0,0,0,0,0,0,0,0,0,0,0,0,0,0,0,0,0,0,0,0,0,0,0,0,0,0,0,0,0,0,0,0,0,0,0,0,0,0,0,0,0,0,0,0,0,0,0,0,0,0,0,0,0,0,0,0,0,0,0,0,0,0,0,0,0,0,0,0,0,0,0,0,0,0,0,0,0,0,0,0,0,0,0,0,0,0,0,0,0,0,0,0,0,0,0,0,0,0,0,0,0,0,0,0,0,0,0,0,0,0,0,1,1,1,1,1,1,1,1,1,2,2,2,2,2,2,2,2,2,2,2,2,4,4,4,4,4,4,4,4,4,4,4,4,4,4,4,4,4,4,4,12,17,17,17,24,24,27,27,27,35,35,35,35,79,91,91,91,134,184]
[]
[]
[]
[]
[]
[]
[]
[]
[]
[]
[]
[]
[]
[]
[]
[]
[]
[]
[]
[]
[]
[]
[]
[]
[]
[]
[]
[]
[]
[]
[]
[]
[]
[]
[]
[]
[]
[]
[]
[]
[]
[]
[]
[]
[]
[]
[]
[]
[]
[]
[]
[]
[]
[]
[]
[]
[]
[]
[]
[]
[]
[]
[]
[]
[]
[]
[]
[]
[]
[]
[]
[]
[]
[]
[]
[]
[]
[]
[]
[]
[]
[]
[]
[]
[]
[]
[]
[]
[]
[]
[]
[]
[]
[]
[]
[]
[]
[]
[]
[]
[]
[]
[]
[]
[]
[]
[]
[]
[]
[]
[]
[]
[]
[]
[]
[]
[]
[]
[]
[]
[]
[]
[]
[]
[]
[]
[]
[]
[]
[]
[]
[]
[]
[]
[]
[]
[]
[]
[]
[]
[]
[]
[]
[]
[]
[]
[]
[]
[]
[]
[]
[]
[]
[]
[]
[]
[]
[]
[]
[]
[]
[]
[]
[]
[]
[]
[]
[]
[]
[]
[]
[]
[]
[]
[]
[]
[]
[]
[]
[]
[]
[]
[]
[]
[]
[]
[]
[]
[]
[]
[]
[]
[]
[]
[]
[]
[]
[]
[]
[]
[]
[]
[]
[]
[]
[]
[]
[]
[]
[]
[]
[]
[]
[]
[]
[]
[]
[]
[]
[]
[]
[]
[]
[]
[]
[]
[]
[]
[]
[]
[]
[]
[]
[]
[]
[]
[]
[]
[]
[]
[]
[]
[]
[]
[]
[]
[]
[]
[]
[]
[]
[]
[]
[]
[]
[]
[]
[]
[]
[]
[]
[]
[]
[]
[]
[]
[]
[]
[]
[]
[]
[]
[]
[]
[]
[]
[]
[]
[]
[]
[]
[]
[]
[]
[]
[]
[]
[]
[]
[]
[]
[]
[]
[]
[]
[]
[]
[]
[]
[]
[]
[]
[]
[]
[]
[]
[]
[]
[]
[]
[]
[]
[]
[]
[]
[]
[]
[]
[]
[]
[]
[]
[]
[]
[]
[]
[]
[]
[]
[]
[]
[]
[]
[]
[]
[]
[]
[]
[]
[]
[]
[]
[]
[]
[]
[]
[]
[]
[]
[]
[]
[]
[]
[]
[]
[]
[]
[]
[]
[]
[]
[]
[]
[]
[]
[]
[]
[]
[]
[]
[]
[]
[]
[]
[]
[]
[]
[]
[]
[]
[]
[]
[]
[]
[]
[]
[]
[]
[]
[]
[]
[]
[]
[]
[]
[]
[]
[]
[]
[]
[]
[]
[]
[]
[]
[]
[]
[]
[]
[]
[]
[]
[]
[]
[]
[]
[]
[]
[]
[]
[]
[]
[]
[]
[]
[]
[]
[]
[]
[]
[]
[]
[]
[]
[]
[]
[]
[]
[]
[]
[]
[]
[]
[]
[]
[]
[]
[]
[]
[]
[]
[]
[]
[]
[]
[]
[]
[]
[]
[]
[]
[]
[]
[]
[]
[]
[]
[]
[]
[]
[]
[]
[]
[]
[]
[]
[]
[]
[]
[]
[]
[]
[]
[]
[]
[]
[]
[]
[]
[]
[]
[]
[]
[]
[]
[]
[]
[]
[]
[]
[]
[]
[]
[]
[]
[]
[]
[]
[]
[]
[]
[]
[]
[]
[]
[]
[]
[]
[]
[]
[]
[]
[]
[]
[]
[]
[]
[]
[]
[]
[]
[]
[]
[]
[]
[]
[]
[]
[]
[]
[]
[]
[]
[]
[]
[]
[]
[]
[]
[]
[]
[]
[]
[]
[]
[]
[]
[]
[]
[]
[]
[]
[]
[]
[]
[]
[]
[]
[]
[]
[]
[]
[]
[]
[]
[]
[]
[]
[]
[]
[]
[]
[]
[]
[]
[]
[]
[]
[]
[]
[]
[]
[]
[]
[]
[]
[]
[]
[]
[]
[]
[]
[]
[]
[]
[]
[]
[]
[]
[]
[]
[]
[]
[]
[]
[]
[]
[]
[]
[]
[]
[]
[]
[]
[]
[]
[]
[]
[]
[]
[]
[]
[]
[]
[]
[]
[]
[]
[]
[]
[]
[]
[]
[]
[]
[]
[]
[]
[]
[]
[]
[]
[]
[]
[]
[]
[]
[]
[]
[]
[]
[]
[]
[]
[]
[]
[]
[]
[]
[]
[]
[]
[]
[]
[]
[]
[]
[]
[]
[]
[]
[]
[]
[]
[]
[]
[]
[]
[]
[]
[]
[]
[]
[]
[]
[]
[]
[]
[]
[]
[]
[]
[]
[]
[]
[]
[]
[]
[]
[]
[]
[]
[]
[]
[]
[]
[]
[]
[]
[]
[]
[]
[]
[]
[]
[]
[]
[]
[]
[]
[]
[]
[null,{"$f":"AVERAGE(B1002:EG1002)","v":3.2409821259329953E-3}]
[17034,17064,17078,17109,17135,17189,17203,17223,17271,17323,17341,17380,17408,17449,17477,17522,17580,17654,17723,17766,17873,17941,18050,18165,18280,18365,18421,18513,18615,18709]
[null,{"$f":"IFERROR(B1001/A1001-1,0)","v":1.7611835153223954E-3},{"$f":"IFERROR(C1001/B1001-1,0)","v":8.2044069385833751E-4},1.8152008431899791E-3,1.5196680109883509E-3,3.1514444120221974E-3,8.1447437314552396E-4,1.1625879207115553E-3,2.7869709109911156E-3,3.0108273985294254E-3,1.0390809905904685E-3,2.2490052476789035E-3,1.611047180667402E-3,2.3552389705883137E-3,1.6046764857584606E-3,2.5748126108600111E-3,3.3101244150210984E-3,4.2093287827076331E-3,3.9084626713492554E-3,2.4262258082716759E-3,6.0227400652932417E-3,3.8046214961113822E-3,6.0754695947828896E-3,6.3711911357340334E-3,6.330856041838695E-3,4.6498905908096688E-3,3.049278518921783E-3,4.9942999837142565E-3,5.5096418732782926E-3,5.0496911093205199E-3]

{"sheet":"Country Chart","index":1,"n_rows":54,"n_cols":14,"rows_kept":54,"cut":false,"hidden":false,"merged":[[33,13,33,15],[34,13,34,15]]}
[]
[]
[]
[]
[]
[]
[]
[null,null,null,null,null,null,null,null,null,null,null,null,null,"Select a Country:"]
[]
[]
[null,null,null,null,null,null,null,null,null,null,null,null,null,"...just type the first letters (search as you type)"]
[]
[]
[]
[]
[]
[null,null,null,null,null,null,null,null,null,null,null,null,null,"Polynomial Equation:"]
[null,null,null,null,null,null,null,null,null,null,null,null,null,"y = 0,0286x3 + 0,4289x2 + 18,815x + 17029"]
[null,null,null,null,null,null,null,null,null,null,null,null,null,"R² = 0,9974"]
[null,null,null,null,null,null,null,null,null,null,null,null,null,"A high R² suggests a good fit of"]
[null,null,null,null,null,null,null,null,null,null,null,null,null,"the polynomial trendline."]
[]
[]
[]
[]
[]
[]
[]
[]
[]
[]
[]
[null,null,null,null,null,null,null,null,null,null,null,null,null,"© Thomas Pflügl, Data Scientist"]
[null,null,null,null,null,null,null,null,null,null,null,null,null,"thomas.pfluegl@aon.at"]
[null,null,null,null,null,null,null,null,null,null,null,null,null,"+43 664-99 50 1700"]
[]
["The data about the novel Coronavirus that causes COVID-19 will be updated daily with data gathered from over a dozen sources by the Johns Hopkins University "]
["Center for Systems Science and Engineering."]
[null,"storymaps.arcgis.com/stories/4fdc0d03d3a34aa485de1fb0d2650ee0"]
[null,"www.arcgis.com/apps/opsdashboard/index.html#/bda7594740fd40299423467b48e9ecf6"]
[null,"github.com/CSSEGISandData/COVID-19/blob/master/csse_covid_19_data/csse_covid_19_time_series/time_series_covid19_confirmed_global.csv"]
[]
["On March 11, the World Health Organization (WHO) declared the novel coronavirus outbreak a global pandemic, underscoring the speed"]
["and tenacity with which it has spread."]
[]
["Bad:"]
["The virus has been diagnosed in at least 114 countries, and on every continent on the planet save Antarctica."]
["But compared to SARS and MERS, SARS-CoV-2 has spread strikingly fast: While the MERS outbreak took about two and a half years to infect 1,000 people, "]
["and SARS took roughly four months, the novel coronavirus reached that figure in just 48 days."]
[]
["Good:"]
["Current figures indicate that the novel coronavirus is significantly less virulent than its relatives. Although the current outbreak has led to over 5,000 deaths"]
["- more than five times as many as SARS - its global fatality rate is around 3.4 percent; in comparison, the fatality rate for SARS was around 10 percent, "]
["and the rate for MERS was around 35 percent. As of early March, more than half of the people who tested positive for the coronavirus had fully recovered."]

{"sheet":"sozialministerium.at","index":2,"n_rows":10,"n_cols":12,"rows_kept":10,"cut":false,"hidden":false,"merged":[[1,1,1,3]]}
[]
[null,"Extract Data from Web"]
["URL:","https://www.sozialministerium.at/Informationen-zum-Coronavirus/Neuartiges-Coronavirus-(2019-nCov).html"]
[]
[null,"Data loaded from Web","Extracted Data","Address"]
[null,"Bisher durchgeführte Testungen in Österreich (tägliche Aktualisierung des Ist-Standes um 08:00 Uhr): 55.863",{"$f":"IF(B6=\"\",\"\",MID(B6,FIND(\"Uhr):\",B6)+6,10))","v":"55.863"},"$A$64",null,null,null,null,null,{"$f":"FIND(\"Uhr):\",B6,FIND(\" \",B6)+2)","v":96}]
[null,"Bestätigte Fälle, Stand 01.04.2020, 15:00 Uhr: 10.482 Fälle, nach Bundesländern: Burgenland (188), Kärnten (293), Niederösterreich (1.685), Oberösterreich (1.671), Salzburg (955), Steiermark (1.113), Tirol (2.414), Vorarlberg (666), Wien (1.497).",{"$f":"IF(B7=\"\",\"\",MID(B7,FIND(\"Uhr:\",B7)+5,L7))","v":"10.482"},"$A$66",null,null,null,null,null,{"$f":"FIND(\"Uhr:\",B7)+4","v":47},{"$f":"FIND(\" \",B7,J7+2)","v":54},{"$f":"K7-J7-1","v":6}]
[null,"Todesfälle(1), Stand 01.04.2020, 10:00 Uhr: 146, nach Bundesländern: Burgenland (3), Kärnten (2), Niederösterreich (28), Oberösterreich (12), Salzburg (11), Steiermark (34), Tirol (24), Vorarlberg (3), Wien (29).",{"$f":"IF(B8=\"\",\"\",MID(B8,FIND(\"Uhr:\",B8)+5,L8))","v":"146"},"$A$68",null,null,null,null,null,{"$f":"FIND(\"Uhr:\",B8,FIND(\" \",B8)+2)","v":40},{"$f":"FIND(\" \",B8,J8+2)","v":44},{"$f":"K8-J8-1","v":3}]
[null,"Genesen, Stand 01.04.2020, 10:00 Uhr: 1.436",{"$f":"IF(B9=\"\",\"\",MID(B9,FIND(\"Uhr:\",B9)+5,L9+5))","v":"1.436"},"$A$70",null,null,null,null,null,34,38,{"$f":"K9-J9-1","v":3}]
[null,"International, Stand 01.04.2020, 15:00 Uhr: Weltweit wurden bisher insgesamt 874.081 bestätigte Fälle bekannt gegeben. ",{"$f":"IF(B10=\"\",\"\",MID(B10,FIND(\"insgesamt \",B10)+10,L10))","v":"874.081"},"$A$72",null,null,null,null,null,{"$f":"FIND(\"insgesamt \",B10,FIND(\" \",B10)+2)","v":68},77,{"$f":"K10-J10-2","v":7}]

{"sheet":"ourworldindata.org_Coronavirus","index":3,"n_rows":29,"n_cols":7,"rows_kept":29,"cut":false,"hidden":false,"merged":[]}
[]
[null,"https://ourworldindata.org/coronavirus-source-data"]
[]
[null,"The data files for the four metrics we present are available to download here:"]
[null,"Total confirmed cases:","https://covid.ourworldindata.org/data/total_cases.csv"]
[null,"Total deaths:","https://covid.ourworldindata.org/data/total_deaths.csv"]
[null,"New confirmed cases:","https://covid.ourworldindata.org/data/new_cases.csv"]
[null,"New deaths:","https://covid.ourworldindata.org/data/new_deaths.csv"]
[null,"Full dataset:","https://covid.ourworldindata.org/data/full_data.csv"]
[]
[null,null,"Date","Austria","%"]
[null,null,"2020-02-26",2]
[null,null,"2020-02-27",2,{"$f":"D13/D12-1","v":0}]
[null,null,"2020-02-28",4,{"$f":"D14/D13-1","v":1}]
[null,null,"2020-02-29",5,0.25]
[null,null,"2020-03-01",10,1]
[null,null,"2020-03-02",10,0]
[null,null,"2020-03-03",18,0.8]
[null,null,"2020-03-04",24,0.33333333333333326]
[null,null,"2020-03-05",37,0.54166666666666674]
[null,null,"2020-03-06",47,0.27027027027027017]
[null,null,"2020-03-07",66,0.4042553191489362]
[null,null,"2020-03-08",104,0.57575757575757569]
[null,null,"2020-03-09",112,7.6923076923076872E-2]
[null,null,"2020-03-10",131,0.16964285714285721]
[null,null,"2020-03-11",182,0.38931297709923673]
[null,null,"2020-03-12",302,0.65934065934065944]
[null,null,"2020-03-13",361,0.19536423841059603]
[null,null,"2020-03-14",504,0.39612188365650969,{"$f":"AVERAGE(E13:E29)","v":0.41541110927939523},{"$f":"AVERAGE(E23:E29)","v":0.35178046690435882}]

{"sheet":"Population Statistics","index":4,"n_rows":265,"n_cols":5,"rows_kept":265,"cut":false,"hidden":false,"merged":[]}
["Country Name","2018","Original name",null,"https://data.worldbank.org/indicator/SP.POP.TOTL"]
["Aruba",105845]
["Afghanistan",37172386]
["Angola",30809762]
["Albania",2866376]
["Andorra",77006]
["Arab World",419790588]
["United Arab Emirates",9630959]
["Argentina",44494502]
["Armenia",2951776]
["American Samoa",55465]
["Antigua and Barbuda",96286]
["Australia",24992369]
["Austria",8847037]
["Azerbaijan",9942334]
["Burundi",11175378]
["Belgium",11422068]
["Benin",11485048]
["Burkina Faso",19751535]
["Bangladesh",161356039]
["Bulgaria",7024216]
["Bahrain",1569439]
["Bahamas, The",385640]
["Bosnia and Herzegovina",3323929]
["Belarus",9485386]
["Belize",383071]
["Bermuda",63968]
["Bolivia",11353142]
["Brazil",209469333]
["Barbados",286641]
["Brunei Darussalam",428962]
["Bhutan",754394]
["Botswana",2254126]
["Central African Republic",4666377]
["Canada",37058856]
["Central Europe and the Baltics",102511922]
["Switzerland",8516543]
["Channel Islands",170499]
["Chile",18729160]
["China",1392730000]
["Cote d'Ivoire",25069229]
["Cameroon",25216237]
["Congo, Dem. Rep.",84068091]
["Congo, Rep.",5244363]
["Colombia",49648685]
["Comoros",832322]
["Cabo Verde",543767]
["Costa Rica",4999441]
["Caribbean small states",7358965]
["Cuba",11338138]
["Curacao",159849]
["Cayman Islands",64174]
["Cyprus",1189265]
["Czech Republic",10625695]
["Germany",82927922]
["Djibouti",958920]
["Dominica",71625]
["Denmark",5797446]
["Dominican Republic",10627165]
["Algeria",42228429]
["East Asia & Pacific (excluding high income)",2081651801]
["Early-demographic dividend",3249140605]
["East Asia & Pacific",2328220870]
["Europe & Central Asia (excluding high income)",417797257]
["Europe & Central Asia",918793590]
["Ecuador",17084357]
["Egypt",98423595,"Egypt, Arab Rep."]
["Euro area",341783171]
["Eritrea"]
["Spain",46723749]
["Estonia",1320884]
["Ethiopia",109224559]
["European Union",513213363]
["Fragile and conflict affected situations",515215936]
["Finland",5518050]
["Fiji",883483]
["France",66987244]
["Faroe Islands",48497]
["Micronesia, Fed. Sts.",112640]
["Gabon",2119275]
["United Kingdom",66488991]
["Georgia",3731000]
["Ghana",29767108]
["Gibraltar",33718]
["Guinea",12414318]
["Gambia, The",2280102]
["Guinea-Bissau",1874309]
["Equatorial Guinea",1308974]
["Greece",10727668]
["Grenada",111454]
["Greenland",56025]
["Guatemala",17247807]
["Guam",165768]
["Guyana",779004]
["High income",1210312147]
["Hong Kong SAR, China",7451000]
["Honduras",9587522]
["Heavily indebted poor countries (HIPC)",780234406]
["Croatia",4089400]
["Haiti",11123176]
["Hungary",9768785]
["IBRD only",4772284113]
["IDA & IBRD total",6412522234]
["IDA total",1640238121]
["IDA blend",555830605]
["Indonesia",267663435]
["IDA only",1084407516]
["Isle of Man",84077]
["India",1352617328]
["Not classified"]
["Ireland",4853506]
["Iran, Islamic Rep.",81800269]
["Iraq",38433600]
["Iceland",353574]
["Israel",8883800]
["Italy",60431283]
["Jamaica",2934855]
["Jordan",9956011]
["Japan",126529100]
["Kazakhstan",18276499]
["Kenya",51393010]
["Kyrgyz Republic",6315800]
["Cambodia",16249798]
["Kiribati",115847]
["St. Kitts and Nevis",52441]
["Korea, Rep.",51635256]
["Kuwait",4137309]
["Latin America & Caribbean (excluding high income)",609013934]
["Lao PDR",7061507]
["Lebanon",6848925]
["Liberia",4818977]
["Libya",6678567]
["St. Lucia",181889]
["Latin America & Caribbean",641357515]
["Least developed countries: UN classification",1009662578]
["Low income",705417321]
["Liechtenstein",37910]
["Sri Lanka",21670000]
["Lower middle income",3022905169]
["Low & middle income",6383958209]
["Lesotho",2108132]
["Late-demographic dividend",2288665963]
["Lithuania",2789533]
["Luxembourg",607728]
["Latvia",1926542]
["Macao SAR, China",631636]
["St. Martin (French part)",37264]
["Morocco",36029138]
["Monaco",38682]
["Moldova",3545883]
["Madagascar",26262368]
["Maldives",515696]
["Middle East & North Africa",448912859]
["Mexico",126190788]
["Marshall Islands",58413]
["Middle income",5678540888]
["North Macedonia",2082958]
["Mali",19077690]
["Malta",483530]
["Myanmar",53708395]
["Middle East & North Africa (excluding high income)",382896715]
["Montenegro",622345]
["Mongolia",3170208]
["Northern Mariana Islands",56882]
["Mozambique",29495962]
["Mauritania",4403319]
["Mauritius",1265303]
["Malawi",18143315]
["Malaysia",31528585]
["North America",364290258]
["Namibia",2448255]
["New Caledonia",284060]
["Niger",22442948]
["Nigeria",195874740]
["Nicaragua",6465513]
["Netherlands",17231017]
["Norway",5314336]
["Nepal",28087871]
["Nauru",12704]
["New Zealand",4885500]
["OECD members",1303529456]
["Oman",4829483]
["Other small states",30758989]
["Pakistan",212215030]
["Panama",4176873]
["Peru",31989256]
["Philippines",106651922]
["Palau",17907]
["Papua New Guinea",8606316]
["Poland",37978548]
["Pre-demographic dividend",919485393]
["Puerto Rico",3195153]
["Korea, Dem. People’s Rep.",25549819]
["Portugal",10281762]
["Paraguay",6956071]
["West Bank and Gaza",4569087]
["Pacific island small states",2457367]
["Post-demographic dividend",1109997273]
["French Polynesia",277679]
["Qatar",2781677]
["Romania",19473936]
["Russian Federation",144478050]
["Rwanda",12301939]
["South Asia",1814388744]
["Saudi Arabia",33699947]
["Sudan",41801533]
["Senegal",15854360]
["Singapore",5638676]
["Solomon Islands",652858]
["Sierra Leone",7650154]
["El Salvador",6420744]
["San Marino",33785]
["Somalia",15008154]
["Serbia",6982084]
["Sub-Saharan Africa (excluding high income)",1078209758]
["South Sudan",10975920]
["Sub-Saharan Africa",1078306520]
["Small states",40575321]
["Sao Tome and Principe",211028]
["Suriname",575991]
["Slovakia",5447011,"Slovak Republic"]
["Slovenia",2067372]
["Sweden",10183175]
["Eswatini",1136191]
["Sint Maarten (Dutch part)",40654]
["Seychelles",96762]
["Syrian Arab Republic",16906283]
["Turks and Caicos Islands",37665]
["Chad",15477751]
["East Asia & Pacific (IDA & IBRD countries)",2056064424]
["Europe & Central Asia (IDA & IBRD countries)",459865205]
["Togo",7889094]
["Thailand",69428524]
["Tajikistan",9100837]
["Turkmenistan",5850908]
["Latin America & the Caribbean (IDA & IBRD countries)",625569713]
["Timor-Leste",1267972]
["Middle East & North Africa (IDA & IBRD countries)",378327628]
["Tonga",103197]
["South Asia (IDA & IBRD)",1814388744]
["Sub-Saharan Africa (IDA & IBRD countries)",1078306520]
["Trinidad and Tobago",1389858]
["Tunisia",11565204]
["Turkey",82319724]
["Tuvalu",11508]
["Tanzania",56318348]
["Uganda",42723139]
["Ukraine",44622516]
["Upper middle income",2655635719]
["Uruguay",3449299]
["United States",327167434]
["Uzbekistan",32955400]
["St. Vincent and the Grenadines",110210]
["Venezuela, RB",28870195]
["British Virgin Islands",29802]
["Virgin Islands (U.S.)",106977]
["Vietnam",95540395]
["Vanuatu",292680]
["World",7594270356]
["Samoa",196130]
["Kosovo",1845300]
["Yemen, Rep.",28498687]
["South Africa",57779622]
["Zambia",17351822]
["Zimbabwe",14439018]

{"sheet":"Full Country Name","index":5,"n_rows":264,"n_cols":1,"rows_kept":264,"cut":false,"hidden":false,"merged":[]}
["Full Country Name"]
[{"$f":"IF('Corona-Covid 19 Data'!B2=\"\",'Corona-Covid 19 Data'!C2,'Corona-Covid 19 Data'!C2&\" \"&'Corona-Covid 19 Data'!B2)","v":"Afghanistan"}]
[{"$f":"IF('Corona-Covid 19 Data'!B3=\"\",'Corona-Covid 19 Data'!C3,'Corona-Covid 19 Data'!C3&\" \"&'Corona-Covid 19 Data'!B3)","v":"Albania"}]
[{"$f":"IF('Corona-Covid 19 Data'!B4=\"\",'Corona-Covid 19 Data'!C4,'Corona-Covid 19 Data'!C4&\" \"&'Corona-Covid 19 Data'!B4)","v":"Algeria"}]
[{"$f":"IF('Corona-Covid 19 Data'!B5=\"\",'Corona-Covid 19 Data'!C5,'Corona-Covid 19 Data'!C5&\" \"&'Corona-Covid 19 Data'!B5)","v":"Andorra"}]
[{"$f":"IF('Corona-Covid 19 Data'!B6=\"\",'Corona-Covid 19 Data'!C6,'Corona-Covid 19 Data'!C6&\" \"&'Corona-Covid 19 Data'!B6)","v":"Angola"}]
[{"$f":"IF('Corona-Covid 19 Data'!B7=\"\",'Corona-Covid 19 Data'!C7,'Corona-Covid 19 Data'!C7&\" \"&'Corona-Covid 19 Data'!B7)","v":"Antigua and Barbuda"}]
[{"$f":"IF('Corona-Covid 19 Data'!B8=\"\",'Corona-Covid 19 Data'!C8,'Corona-Covid 19 Data'!C8&\" \"&'Corona-Covid 19 Data'!B8)","v":"Argentina"}]
[{"$f":"IF('Corona-Covid 19 Data'!B9=\"\",'Corona-Covid 19 Data'!C9,'Corona-Covid 19 Data'!C9&\" \"&'Corona-Covid 19 Data'!B9)","v":"Armenia"}]
[{"$f":"IF('Corona-Covid 19 Data'!B10=\"\",'Corona-Covid 19 Data'!C10,'Corona-Covid 19 Data'!C10&\" \"&'Corona-Covid 19 Data'!B10)","v":"Australia Australian Capital Territory"}]
[{"$f":"IF('Corona-Covid 19 Data'!B11=\"\",'Corona-Covid 19 Data'!C11,'Corona-Covid 19 Data'!C11&\" \"&'Corona-Covid 19 Data'!B11)","v":"Australia New South Wales"}]
[{"$f":"IF('Corona-Covid 19 Data'!B12=\"\",'Corona-Covid 19 Data'!C12,'Corona-Covid 19 Data'!C12&\" \"&'Corona-Covid 19 Data'!B12)","v":"Australia Northern Territory"}]
[{"$f":"IF('Corona-Covid 19 Data'!B13=\"\",'Corona-Covid 19 Data'!C13,'Corona-Covid 19 Data'!C13&\" \"&'Corona-Covid 19 Data'!B13)","v":"Australia Queensland"}]
[{"$f":"IF('Corona-Covid 19 Data'!B14=\"\",'Corona-Covid 19 Data'!C14,'Corona-Covid 19 Data'!C14&\" \"&'Corona-Covid 19 Data'!B14)","v":"Australia South Australia"}]
[{"$f":"IF('Corona-Covid 19 Data'!B15=\"\",'Corona-Covid 19 Data'!C15,'Corona-Covid 19 Data'!C15&\" \"&'Corona-Covid 19 Data'!B15)","v":"Australia Tasmania"}]
[{"$f":"IF('Corona-Covid 19 Data'!B16=\"\",'Corona-Covid 19 Data'!C16,'Corona-Covid 19 Data'!C16&\" \"&'Corona-Covid 19 Data'!B16)","v":"Australia Victoria"}]
[{"$f":"IF('Corona-Covid 19 Data'!B17=\"\",'Corona-Covid 19 Data'!C17,'Corona-Covid 19 Data'!C17&\" \"&'Corona-Covid 19 Data'!B17)","v":"Australia Western Australia"}]
[{"$f":"IF('Corona-Covid 19 Data'!B18=\"\",'Corona-Covid 19 Data'!C18,'Corona-Covid 19 Data'!C18&\" \"&'Corona-Covid 19 Data'!B18)","v":"Austria"}]
[{"$f":"IF('Corona-Covid 19 Data'!B19=\"\",'Corona-Covid 19 Data'!C19,'Corona-Covid 19 Data'!C19&\" \"&'Corona-Covid 19 Data'!B19)","v":"Azerbaijan"}]
[{"$f":"IF('Corona-Covid 19 Data'!B20=\"\",'Corona-Covid 19 Data'!C20,'Corona-Covid 19 Data'!C20&\" \"&'Corona-Covid 19 Data'!B20)","v":"Bahamas"}]
[{"$f":"IF('Corona-Covid 19 Data'!B21=\"\",'Corona-Covid 19 Data'!C21,'Corona-Covid 19 Data'!C21&\" \"&'Corona-Covid 19 Data'!B21)","v":"Bahrain"}]
[{"$f":"IF('Corona-Covid 19 Data'!B22=\"\",'Corona-Covid 19 Data'!C22,'Corona-Covid 19 Data'!C22&\" \"&'Corona-Covid 19 Data'!B22)","v":"Bangladesh"}]
[{"$f":"IF('Corona-Covid 19 Data'!B23=\"\",'Corona-Covid 19 Data'!C23,'Corona-Covid 19 Data'!C23&\" \"&'Corona-Covid 19 Data'!B23)","v":"Barbados"}]
[{"$f":"IF('Corona-Covid 19 Data'!B24=\"\",'Corona-Covid 19 Data'!C24,'Corona-Covid 19 Data'!C24&\" \"&'Corona-Covid 19 Data'!B24)","v":"Belarus"}]
[{"$f":"IF('Corona-Covid 19 Data'!B25=\"\",'Corona-Covid 19 Data'!C25,'Corona-Covid 19 Data'!C25&\" \"&'Corona-Covid 19 Data'!B25)","v":"Belgium"}]
[{"$f":"IF('Corona-Covid 19 Data'!B26=\"\",'Corona-Covid 19 Data'!C26,'Corona-Covid 19 Data'!C26&\" \"&'Corona-Covid 19 Data'!B26)","v":"Benin"}]
[{"$f":"IF('Corona-Covid 19 Data'!B27=\"\",'Corona-Covid 19 Data'!C27,'Corona-Covid 19 Data'!C27&\" \"&'Corona-Covid 19 Data'!B27)","v":"Bhutan"}]
[{"$f":"IF('Corona-Covid 19 Data'!B28=\"\",'Corona-Covid 19 Data'!C28,'Corona-Covid 19 Data'!C28&\" \"&'Corona-Covid 19 Data'!B28)","v":"Bolivia"}]
[{"$f":"IF('Corona-Covid 19 Data'!B29=\"\",'Corona-Covid 19 Data'!C29,'Corona-Covid 19 Data'!C29&\" \"&'Corona-Covid 19 Data'!B29)","v":"Bosnia and Herzegovina"}]
[{"$f":"IF('Corona-Covid 19 Data'!B30=\"\",'Corona-Covid 19 Data'!C30,'Corona-Covid 19 Data'!C30&\" \"&'Corona-Covid 19 Data'!B30)","v":"Brazil"}]
[{"$f":"IF('Corona-Covid 19 Data'!B31=\"\",'Corona-Covid 19 Data'!C31,'Corona-Covid 19 Data'!C31&\" \"&'Corona-Covid 19 Data'!B31)","v":"Brunei"}]
[{"$f":"IF('Corona-Covid 19 Data'!B32=\"\",'Corona-Covid 19 Data'!C32,'Corona-Covid 19 Data'!C32&\" \"&'Corona-Covid 19 Data'!B32)","v":"Bulgaria"}]
[{"$f":"IF('Corona-Covid 19 Data'!B33=\"\",'Corona-Covid 19 Data'!C33,'Corona-Covid 19 Data'!C33&\" \"&'Corona-Covid 19 Data'!B33)","v":"Burkina Faso"}]
[{"$f":"IF('Corona-Covid 19 Data'!B34=\"\",'Corona-Covid 19 Data'!C34,'Corona-Covid 19 Data'!C34&\" \"&'Corona-Covid 19 Data'!B34)","v":"Cabo Verde"}]
[{"$f":"IF('Corona-Covid 19 Data'!B35=\"\",'Corona-Covid 19 Data'!C35,'Corona-Covid 19 Data'!C35&\" \"&'Corona-Covid 19 Data'!B35)","v":"Cambodia"}]
[{"$f":"IF('Corona-Covid 19 Data'!B36=\"\",'Corona-Covid 19 Data'!C36,'Corona-Covid 19 Data'!C36&\" \"&'Corona-Covid 19 Data'!B36)","v":"Cameroon"}]
[{"$f":"IF('Corona-Covid 19 Data'!B37=\"\",'Corona-Covid 19 Data'!C37,'Corona-Covid 19 Data'!C37&\" \"&'Corona-Covid 19 Data'!B37)","v":"Canada Alberta"}]
[{"$f":"IF('Corona-Covid 19 Data'!B38=\"\",'Corona-Covid 19 Data'!C38,'Corona-Covid 19 Data'!C38&\" \"&'Corona-Covid 19 Data'!B38)","v":"Canada British Columbia"}]
[{"$f":"IF('Corona-Covid 19 Data'!B39=\"\",'Corona-Covid 19 Data'!C39,'Corona-Covid 19 Data'!C39&\" \"&'Corona-Covid 19 Data'!B39)","v":"Canada Grand Princess"}]
[{"$f":"IF('Corona-Covid 19 Data'!B40=\"\",'Corona-Covid 19 Data'!C40,'Corona-Covid 19 Data'!C40&\" \"&'Corona-Covid 19 Data'!B40)","v":"Canada Manitoba"}]
[{"$f":"IF('Corona-Covid 19 Data'!B41=\"\",'Corona-Covid 19 Data'!C41,'Corona-Covid 19 Data'!C41&\" \"&'Corona-Covid 19 Data'!B41)","v":"Canada New Brunswick"}]
[{"$f":"IF('Corona-Covid 19 Data'!B42=\"\",'Corona-Covid 19 Data'!C42,'Corona-Covid 19 Data'!C42&\" \"&'Corona-Covid 19 Data'!B42)","v":"Canada Newfoundland and Labrador"}]
[{"$f":"IF('Corona-Covid 19 Data'!B43=\"\",'Corona-Covid 19 Data'!C43,'Corona-Covid 19 Data'!C43&\" \"&'Corona-Covid 19 Data'!B43)","v":"Canada Nova Scotia"}]
[{"$f":"IF('Corona-Covid 19 Data'!B44=\"\",'Corona-Covid 19 Data'!C44,'Corona-Covid 19 Data'!C44&\" \"&'Corona-Covid 19 Data'!B44)","v":"Canada Ontario"}]
[{"$f":"IF('Corona-Covid 19 Data'!B45=\"\",'Corona-Covid 19 Data'!C45,'Corona-Covid 19 Data'!C45&\" \"&'Corona-Covid 19 Data'!B45)","v":"Canada Prince Edward Island"}]
[{"$f":"IF('Corona-Covid 19 Data'!B46=\"\",'Corona-Covid 19 Data'!C46,'Corona-Covid 19 Data'!C46&\" \"&'Corona-Covid 19 Data'!B46)","v":"Canada Quebec"}]
[{"$f":"IF('Corona-Covid 19 Data'!B47=\"\",'Corona-Covid 19 Data'!C47,'Corona-Covid 19 Data'!C47&\" \"&'Corona-Covid 19 Data'!B47)","v":"Canada Saskatchewan"}]
[{"$f":"IF('Corona-Covid 19 Data'!B48=\"\",'Corona-Covid 19 Data'!C48,'Corona-Covid 19 Data'!C48&\" \"&'Corona-Covid 19 Data'!B48)","v":"Central African Republic"}]
[{"$f":"IF('Corona-Covid 19 Data'!B49=\"\",'Corona-Covid 19 Data'!C49,'Corona-Covid 19 Data'!C49&\" \"&'Corona-Covid 19 Data'!B49)","v":"Chad"}]
[{"$f":"IF('Corona-Covid 19 Data'!B50=\"\",'Corona-Covid 19 Data'!C50,'Corona-Covid 19 Data'!C50&\" \"&'Corona-Covid 19 Data'!B50)","v":"Chile"}]
[{"$f":"IF('Corona-Covid 19 Data'!B51=\"\",'Corona-Covid 19 Data'!C51,'Corona-Covid 19 Data'!C51&\" \"&'Corona-Covid 19 Data'!B51)","v":"China Anhui"}]
[{"$f":"IF('Corona-Covid 19 Data'!B52=\"\",'Corona-Covid 19 Data'!C52,'Corona-Covid 19 Data'!C52&\" \"&'Corona-Covid 19 Data'!B52)","v":"China Beijing"}]
[{"$f":"IF('Corona-Covid 19 Data'!B53=\"\",'Corona-Covid 19 Data'!C53,'Corona-Covid 19 Data'!C53&\" \"&'Corona-Covid 19 Data'!B53)","v":"China Chongqing"}]
[{"$f":"IF('Corona-Covid 19 Data'!B54=\"\",'Corona-Covid 19 Data'!C54,'Corona-Covid 19 Data'!C54&\" \"&'Corona-Covid 19 Data'!B54)","v":"China Fujian"}]
[{"$f":"IF('Corona-Covid 19 Data'!B55=\"\",'Corona-Covid 19 Data'!C55,'Corona-Covid 19 Data'!C55&\" \"&'Corona-Covid 19 Data'!B55)","v":"China Gansu"}]
[{"$f":"IF('Corona-Covid 19 Data'!B56=\"\",'Corona-Covid 19 Data'!C56,'Corona-Covid 19 Data'!C56&\" \"&'Corona-Covid 19 Data'!B56)","v":"China Guangdong"}]
[{"$f":"IF('Corona-Covid 19 Data'!B57=\"\",'Corona-Covid 19 Data'!C57,'Corona-Covid 19 Data'!C57&\" \"&'Corona-Covid 19 Data'!B57)","v":"China Guangxi"}]
[{"$f":"IF('Corona-Covid 19 Data'!B58=\"\",'Corona-Covid 19 Data'!C58,'Corona-Covid 19 Data'!C58&\" \"&'Corona-Covid 19 Data'!B58)","v":"China Guizhou"}]
[{"$f":"IF('Corona-Covid 19 Data'!B59=\"\",'Corona-Covid 19 Data'!C59,'Corona-Covid 19 Data'!C59&\" \"&'Corona-Covid 19 Data'!B59)","v":"China Hainan"}]
[{"$f":"IF('Corona-Covid 19 Data'!B60=\"\",'Corona-Covid 19 Data'!C60,'Corona-Covid 19 Data'!C60&\" \"&'Corona-Covid 19 Data'!B60)","v":"China Hebei"}]
[{"$f":"IF('Corona-Covid 19 Data'!B61=\"\",'Corona-Covid 19 Data'!C61,'Corona-Covid 19 Data'!C61&\" \"&'Corona-Covid 19 Data'!B61)","v":"China Heilongjiang"}]
[{"$f":"IF('Corona-Covid 19 Data'!B62=\"\",'Corona-Covid 19 Data'!C62,'Corona-Covid 19 Data'!C62&\" \"&'Corona-Covid 19 Data'!B62)","v":"China Henan"}]
[{"$f":"IF('Corona-Covid 19 Data'!B63=\"\",'Corona-Covid 19 Data'!C63,'Corona-Covid 19 Data'!C63&\" \"&'Corona-Covid 19 Data'!B63)","v":"China Hong Kong"}]
[{"$f":"IF('Corona-Covid 19 Data'!B64=\"\",'Corona-Covid 19 Data'!C64,'Corona-Covid 19 Data'!C64&\" \"&'Corona-Covid 19 Data'!B64)","v":"China Hubei"}]
[{"$f":"IF('Corona-Covid 19 Data'!B65=\"\",'Corona-Covid 19 Data'!C65,'Corona-Covid 19 Data'!C65&\" \"&'Corona-Covid 19 Data'!B65)","v":"China Hunan"}]
[{"$f":"IF('Corona-Covid 19 Data'!B66=\"\",'Corona-Covid 19 Data'!C66,'Corona-Covid 19 Data'!C66&\" \"&'Corona-Covid 19 Data'!B66)","v":"China Inner Mongolia"}]
[{"$f":"IF('Corona-Covid 19 Data'!B67=\"\",'Corona-Covid 19 Data'!C67,'Corona-Covid 19 Data'!C67&\" \"&'Corona-Covid 19 Data'!B67)","v":"China Jiangsu"}]
[{"$f":"IF('Corona-Covid 19 Data'!B68=\"\",'Corona-Covid 19 Data'!C68,'Corona-Covid 19 Data'!C68&\" \"&'Corona-Covid 19 Data'!B68)","v":"China Jiangxi"}]
[{"$f":"IF('Corona-Covid 19 Data'!B69=\"\",'Corona-Covid 19 Data'!C69,'Corona-Covid 19 Data'!C69&\" \"&'Corona-Covid 19 Data'!B69)","v":"China Jilin"}]
[{"$f":"IF('Corona-Covid 19 Data'!B70=\"\",'Corona-Covid 19 Data'!C70,'Corona-Covid 19 Data'!C70&\" \"&'Corona-Covid 19 Data'!B70)","v":"China Liaoning"}]
[{"$f":"IF('Corona-Covid 19 Data'!B71=\"\",'Corona-Covid 19 Data'!C71,'Corona-Covid 19 Data'!C71&\" \"&'Corona-Covid 19 Data'!B71)","v":"China Macau"}]
[{"$f":"IF('Corona-Covid 19 Data'!B72=\"\",'Corona-Covid 19 Data'!C72,'Corona-Covid 19 Data'!C72&\" \"&'Corona-Covid 19 Data'!B72)","v":"China Ningxia"}]
[{"$f":"IF('Corona-Covid 19 Data'!B73=\"\",'Corona-Covid 19 Data'!C73,'Corona-Covid 19 Data'!C73&\" \"&'Corona-Covid 19 Data'!B73)","v":"China Qinghai"}]
[{"$f":"IF('Corona-Covid 19 Data'!B74=\"\",'Corona-Covid 19 Data'!C74,'Corona-Covid 19 Data'!C74&\" \"&'Corona-Covid 19 Data'!B74)","v":"China Shaanxi"}]
[{"$f":"IF('Corona-Covid 19 Data'!B75=\"\",'Corona-Covid 19 Data'!C75,'Corona-Covid 19 Data'!C75&\" \"&'Corona-Covid 19 Data'!B75)","v":"China Shandong"}]
[{"$f":"IF('Corona-Covid 19 Data'!B76=\"\",'Corona-Covid 19 Data'!C76,'Corona-Covid 19 Data'!C76&\" \"&'Corona-Covid 19 Data'!B76)","v":"China Shanghai"}]
[{"$f":"IF('Corona-Covid 19 Data'!B77=\"\",'Corona-Covid 19 Data'!C77,'Corona-Covid 19 Data'!C77&\" \"&'Corona-Covid 19 Data'!B77)","v":"China Shanxi"}]
[{"$f":"IF('Corona-Covid 19 Data'!B78=\"\",'Corona-Covid 19 Data'!C78,'Corona-Covid 19 Data'!C78&\" \"&'Corona-Covid 19 Data'!B78)","v":"China Sichuan"}]
[{"$f":"IF('Corona-Covid 19 Data'!B79=\"\",'Corona-Covid 19 Data'!C79,'Corona-Covid 19 Data'!C79&\" \"&'Corona-Covid 19 Data'!B79)","v":"China Tianjin"}]
[{"$f":"IF('Corona-Covid 19 Data'!B80=\"\",'Corona-Covid 19 Data'!C80,'Corona-Covid 19 Data'!C80&\" \"&'Corona-Covid 19 Data'!B80)","v":"China Tibet"}]
[{"$f":"IF('Corona-Covid 19 Data'!B81=\"\",'Corona-Covid 19 Data'!C81,'Corona-Covid 19 Data'!C81&\" \"&'Corona-Covid 19 Data'!B81)","v":"China Xinjiang"}]
[{"$f":"IF('Corona-Covid 19 Data'!B82=\"\",'Corona-Covid 19 Data'!C82,'Corona-Covid 19 Data'!C82&\" \"&'Corona-Covid 19 Data'!B82)","v":"China Yunnan"}]
[{"$f":"IF('Corona-Covid 19 Data'!B83=\"\",'Corona-Covid 19 Data'!C83,'Corona-Covid 19 Data'!C83&\" \"&'Corona-Covid 19 Data'!B83)","v":"China Zhejiang"}]
[{"$f":"IF('Corona-Covid 19 Data'!B84=\"\",'Corona-Covid 19 Data'!C84,'Corona-Covid 19 Data'!C84&\" \"&'Corona-Covid 19 Data'!B84)","v":"Colombia"}]
[{"$f":"IF('Corona-Covid 19 Data'!B85=\"\",'Corona-Covid 19 Data'!C85,'Corona-Covid 19 Data'!C85&\" \"&'Corona-Covid 19 Data'!B85)","v":"Congo (Brazzaville)"}]
[{"$f":"IF('Corona-Covid 19 Data'!B86=\"\",'Corona-Covid 19 Data'!C86,'Corona-Covid 19 Data'!C86&\" \"&'Corona-Covid 19 Data'!B86)","v":"Congo (Kinshasa)"}]
[{"$f":"IF('Corona-Covid 19 Data'!B87=\"\",'Corona-Covid 19 Data'!C87,'Corona-Covid 19 Data'!C87&\" \"&'Corona-Covid 19 Data'!B87)","v":"Costa Rica"}]
[{"$f":"IF('Corona-Covid 19 Data'!B88=\"\",'Corona-Covid 19 Data'!C88,'Corona-Covid 19 Data'!C88&\" \"&'Corona-Covid 19 Data'!B88)","v":"Cote d'Ivoire"}]
[{"$f":"IF('Corona-Covid 19 Data'!B89=\"\",'Corona-Covid 19 Data'!C89,'Corona-Covid 19 Data'!C89&\" \"&'Corona-Covid 19 Data'!B89)","v":"Croatia"}]
[{"$f":"IF('Corona-Covid 19 Data'!B90=\"\",'Corona-Covid 19 Data'!C90,'Corona-Covid 19 Data'!C90&\" \"&'Corona-Covid 19 Data'!B90)","v":"Diamond Princess"}]
[{"$f":"IF('Corona-Covid 19 Data'!B91=\"\",'Corona-Covid 19 Data'!C91,'Corona-Covid 19 Data'!C91&\" \"&'Corona-Covid 19 Data'!B91)","v":"Cuba"}]
[{"$f":"IF('Corona-Covid 19 Data'!B92=\"\",'Corona-Covid 19 Data'!C92,'Corona-Covid 19 Data'!C92&\" \"&'Corona-Covid 19 Data'!B92)","v":"Cyprus"}]
[{"$f":"IF('Corona-Covid 19 Data'!B93=\"\",'Corona-Covid 19 Data'!C93,'Corona-Covid 19 Data'!C93&\" \"&'Corona-Covid 19 Data'!B93)","v":"Czechia"}]
[{"$f":"IF('Corona-Covid 19 Data'!B94=\"\",'Corona-Covid 19 Data'!C94,'Corona-Covid 19 Data'!C94&\" \"&'Corona-Covid 19 Data'!B94)","v":"Denmark Faroe Islands"}]
[{"$f":"IF('Corona-Covid 19 Data'!B95=\"\",'Corona-Covid 19 Data'!C95,'Corona-Covid 19 Data'!C95&\" \"&'Corona-Covid 19 Data'!B95)","v":"Denmark Greenland"}]
[{"$f":"IF('Corona-Covid 19 Data'!B96=\"\",'Corona-Covid 19 Data'!C96,'Corona-Covid 19 Data'!C96&\" \"&'Corona-Covid 19 Data'!B96)","v":"Denmark"}]
[{"$f":"IF('Corona-Covid 19 Data'!B97=\"\",'Corona-Covid 19 Data'!C97,'Corona-Covid 19 Data'!C97&\" \"&'Corona-Covid 19 Data'!B97)","v":"Djibouti"}]
[{"$f":"IF('Corona-Covid 19 Data'!B98=\"\",'Corona-Covid 19 Data'!C98,'Corona-Covid 19 Data'!C98&\" \"&'Corona-Covid 19 Data'!B98)","v":"Dominican Republic"}]
[{"$f":"IF('Corona-Covid 19 Data'!B99=\"\",'Corona-Covid 19 Data'!C99,'Corona-Covid 19 Data'!C99&\" \"&'Corona-Covid 19 Data'!B99)","v":"Ecuador"}]
[{"$f":"IF('Corona-Covid 19 Data'!B100=\"\",'Corona-Covid 19 Data'!C100,'Corona-Covid 19 Data'!C100&\" \"&'Corona-Covid 19 Data'!B100)","v":"Egypt"}]
[{"$f":"IF('Corona-Covid 19 Data'!B101=\"\",'Corona-Covid 19 Data'!C101,'Corona-Covid 19 Data'!C101&\" \"&'Corona-Covid 19 Data'!B101)","v":"El Salvador"}]
[{"$f":"IF('Corona-Covid 19 Data'!B102=\"\",'Corona-Covid 19 Data'!C102,'Corona-Covid 19 Data'!C102&\" \"&'Corona-Covid 19 Data'!B102)","v":"Equatorial Guinea"}]
[{"$f":"IF('Corona-Covid 19 Data'!B103=\"\",'Corona-Covid 19 Data'!C103,'Corona-Covid 19 Data'!C103&\" \"&'Corona-Covid 19 Data'!B103)","v":"Eritrea"}]
[{"$f":"IF('Corona-Covid 19 Data'!B104=\"\",'Corona-Covid 19 Data'!C104,'Corona-Covid 19 Data'!C104&\" \"&'Corona-Covid 19 Data'!B104)","v":"Estonia"}]
[{"$f":"IF('Corona-Covid 19 Data'!B105=\"\",'Corona-Covid 19 Data'!C105,'Corona-Covid 19 Data'!C105&\" \"&'Corona-Covid 19 Data'!B105)","v":"Eswatini"}]
[{"$f":"IF('Corona-Covid 19 Data'!B106=\"\",'Corona-Covid 19 Data'!C106,'Corona-Covid 19 Data'!C106&\" \"&'Corona-Covid 19 Data'!B106)","v":"Ethiopia"}]
[{"$f":"IF('Corona-Covid 19 Data'!B107=\"\",'Corona-Covid 19 Data'!C107,'Corona-Covid 19 Data'!C107&\" \"&'Corona-Covid 19 Data'!B107)","v":"Fiji"}]
[{"$f":"IF('Corona-Covid 19 Data'!B108=\"\",'Corona-Covid 19 Data'!C108,'Corona-Covid 19 Data'!C108&\" \"&'Corona-Covid 19 Data'!B108)","v":"Finland"}]
[{"$f":"IF('Corona-Covid 19 Data'!B109=\"\",'Corona-Covid 19 Data'!C109,'Corona-Covid 19 Data'!C109&\" \"&'Corona-Covid 19 Data'!B109)","v":"France French Guiana"}]
[{"$f":"IF('Corona-Covid 19 Data'!B110=\"\",'Corona-Covid 19 Data'!C110,'Corona-Covid 19 Data'!C110&\" \"&'Corona-Covid 19 Data'!B110)","v":"France French Polynesia"}]
[{"$f":"IF('Corona-Covid 19 Data'!B111=\"\",'Corona-Covid 19 Data'!C111,'Corona-Covid 19 Data'!C111&\" \"&'Corona-Covid 19 Data'!B111)","v":"France Guadeloupe"}]
[{"$f":"IF('Corona-Covid 19 Data'!B112=\"\",'Corona-Covid 19 Data'!C112,'Corona-Covid 19 Data'!C112&\" \"&'Corona-Covid 19 Data'!B112)","v":"France Mayotte"}]
[{"$f":"IF('Corona-Covid 19 Data'!B113=\"\",'Corona-Covid 19 Data'!C113,'Corona-Covid 19 Data'!C113&\" \"&'Corona-Covid 19 Data'!B113)","v":"France New Caledonia"}]
[{"$f":"IF('Corona-Covid 19 Data'!B114=\"\",'Corona-Covid 19 Data'!C114,'Corona-Covid 19 Data'!C114&\" \"&'Corona-Covid 19 Data'!B114)","v":"France Reunion"}]
[{"$f":"IF('Corona-Covid 19 Data'!B115=\"\",'Corona-Covid 19 Data'!C115,'Corona-Covid 19 Data'!C115&\" \"&'Corona-Covid 19 Data'!B115)","v":"France Saint Barthelemy"}]
[{"$f":"IF('Corona-Covid 19 Data'!B116=\"\",'Corona-Covid 19 Data'!C116,'Corona-Covid 19 Data'!C116&\" \"&'Corona-Covid 19 Data'!B116)","v":"France St Martin"}]
[{"$f":"IF('Corona-Covid 19 Data'!B117=\"\",'Corona-Covid 19 Data'!C117,'Corona-Covid 19 Data'!C117&\" \"&'Corona-Covid 19 Data'!B117)","v":"France Martinique"}]
[{"$f":"IF('Corona-Covid 19 Data'!B118=\"\",'Corona-Covid 19 Data'!C118,'Corona-Covid 19 Data'!C118&\" \"&'Corona-Covid 19 Data'!B118)","v":"France"}]
[{"$f":"IF('Corona-Covid 19 Data'!B119=\"\",'Corona-Covid 19 Data'!C119,'Corona-Covid 19 Data'!C119&\" \"&'Corona-Covid 19 Data'!B119)","v":"Gabon"}]
[{"$f":"IF('Corona-Covid 19 Data'!B120=\"\",'Corona-Covid 19 Data'!C120,'Corona-Covid 19 Data'!C120&\" \"&'Corona-Covid 19 Data'!B120)","v":"Gambia"}]
[{"$f":"IF('Corona-Covid 19 Data'!B121=\"\",'Corona-Covid 19 Data'!C121,'Corona-Covid 19 Data'!C121&\" \"&'Corona-Covid 19 Data'!B121)","v":"Georgia"}]
[{"$f":"IF('Corona-Covid 19 Data'!B122=\"\",'Corona-Covid 19 Data'!C122,'Corona-Covid 19 Data'!C122&\" \"&'Corona-Covid 19 Data'!B122)","v":"Germany"}]
[{"$f":"IF('Corona-Covid 19 Data'!B123=\"\",'Corona-Covid 19 Data'!C123,'Corona-Covid 19 Data'!C123&\" \"&'Corona-Covid 19 Data'!B123)","v":"Ghana"}]
[{"$f":"IF('Corona-Covid 19 Data'!B124=\"\",'Corona-Covid 19 Data'!C124,'Corona-Covid 19 Data'!C124&\" \"&'Corona-Covid 19 Data'!B124)","v":"Greece"}]
[{"$f":"IF('Corona-Covid 19 Data'!B125=\"\",'Corona-Covid 19 Data'!C125,'Corona-Covid 19 Data'!C125&\" \"&'Corona-Covid 19 Data'!B125)","v":"Guatemala"}]
[{"$f":"IF('Corona-Covid 19 Data'!B126=\"\",'Corona-Covid 19 Data'!C126,'Corona-Covid 19 Data'!C126&\" \"&'Corona-Covid 19 Data'!B126)","v":"Guinea"}]
[{"$f":"IF('Corona-Covid 19 Data'!B127=\"\",'Corona-Covid 19 Data'!C127,'Corona-Covid 19 Data'!C127&\" \"&'Corona-Covid 19 Data'!B127)","v":"Guyana"}]
[{"$f":"IF('Corona-Covid 19 Data'!B128=\"\",'Corona-Covid 19 Data'!C128,'Corona-Covid 19 Data'!C128&\" \"&'Corona-Covid 19 Data'!B128)","v":"Haiti"}]
[{"$f":"IF('Corona-Covid 19 Data'!B129=\"\",'Corona-Covid 19 Data'!C129,'Corona-Covid 19 Data'!C129&\" \"&'Corona-Covid 19 Data'!B129)","v":"Holy See"}]
[{"$f":"IF('Corona-Covid 19 Data'!B130=\"\",'Corona-Covid 19 Data'!C130,'Corona-Covid 19 Data'!C130&\" \"&'Corona-Covid 19 Data'!B130)","v":"Honduras"}]
[{"$f":"IF('Corona-Covid 19 Data'!B131=\"\",'Corona-Covid 19 Data'!C131,'Corona-Covid 19 Data'!C131&\" \"&'Corona-Covid 19 Data'!B131)","v":"Hungary"}]
[{"$f":"IF('Corona-Covid 19 Data'!B132=\"\",'Corona-Covid 19 Data'!C132,'Corona-Covid 19 Data'!C132&\" \"&'Corona-Covid 19 Data'!B132)","v":"Iceland"}]
[{"$f":"IF('Corona-Covid 19 Data'!B133=\"\",'Corona-Covid 19 Data'!C133,'Corona-Covid 19 Data'!C133&\" \"&'Corona-Covid 19 Data'!B133)","v":"India"}]
[{"$f":"IF('Corona-Covid 19 Data'!B134=\"\",'Corona-Covid 19 Data'!C134,'Corona-Covid 19 Data'!C134&\" \"&'Corona-Covid 19 Data'!B134)","v":"Indonesia"}]
[{"$f":"IF('Corona-Covid 19 Data'!B135=\"\",'Corona-Covid 19 Data'!C135,'Corona-Covid 19 Data'!C135&\" \"&'Corona-Covid 19 Data'!B135)","v":"Iran"}]
[{"$f":"IF('Corona-Covid 19 Data'!B136=\"\",'Corona-Covid 19 Data'!C136,'Corona-Covid 19 Data'!C136&\" \"&'Corona-Covid 19 Data'!B136)","v":"Iraq"}]
[{"$f":"IF('Corona-Covid 19 Data'!B137=\"\",'Corona-Covid 19 Data'!C137,'Corona-Covid 19 Data'!C137&\" \"&'Corona-Covid 19 Data'!B137)","v":"Ireland"}]
[{"$f":"IF('Corona-Covid 19 Data'!B138=\"\",'Corona-Covid 19 Data'!C138,'Corona-Covid 19 Data'!C138&\" \"&'Corona-Covid 19 Data'!B138)","v":"Israel"}]
[{"$f":"IF('Corona-Covid 19 Data'!B139=\"\",'Corona-Covid 19 Data'!C139,'Corona-Covid 19 Data'!C139&\" \"&'Corona-Covid 19 Data'!B139)","v":"Italy"}]
[{"$f":"IF('Corona-Covid 19 Data'!B140=\"\",'Corona-Covid 19 Data'!C140,'Corona-Covid 19 Data'!C140&\" \"&'Corona-Covid 19 Data'!B140)","v":"Jamaica"}]
[{"$f":"IF('Corona-Covid 19 Data'!B141=\"\",'Corona-Covid 19 Data'!C141,'Corona-Covid 19 Data'!C141&\" \"&'Corona-Covid 19 Data'!B141)","v":"Japan"}]
[{"$f":"IF('Corona-Covid 19 Data'!B142=\"\",'Corona-Covid 19 Data'!C142,'Corona-Covid 19 Data'!C142&\" \"&'Corona-Covid 19 Data'!B142)","v":"Jordan"}]
[{"$f":"IF('Corona-Covid 19 Data'!B143=\"\",'Corona-Covid 19 Data'!C143,'Corona-Covid 19 Data'!C143&\" \"&'Corona-Covid 19 Data'!B143)","v":"Kazakhstan"}]
[{"$f":"IF('Corona-Covid 19 Data'!B144=\"\",'Corona-Covid 19 Data'!C144,'Corona-Covid 19 Data'!C144&\" \"&'Corona-Covid 19 Data'!B144)","v":"Kenya"}]
[{"$f":"IF('Corona-Covid 19 Data'!B145=\"\",'Corona-Covid 19 Data'!C145,'Corona-Covid 19 Data'!C145&\" \"&'Corona-Covid 19 Data'!B145)","v":"Korea, South"}]
[{"$f":"IF('Corona-Covid 19 Data'!B146=\"\",'Corona-Covid 19 Data'!C146,'Corona-Covid 19 Data'!C146&\" \"&'Corona-Covid 19 Data'!B146)","v":"Kuwait"}]
[{"$f":"IF('Corona-Covid 19 Data'!B147=\"\",'Corona-Covid 19 Data'!C147,'Corona-Covid 19 Data'!C147&\" \"&'Corona-Covid 19 Data'!B147)","v":"Kyrgyzstan"}]
[{"$f":"IF('Corona-Covid 19 Data'!B148=\"\",'Corona-Covid 19 Data'!C148,'Corona-Covid 19 Data'!C148&\" \"&'Corona-Covid 19 Data'!B148)","v":"Latvia"}]
[{"$f":"IF('Corona-Covid 19 Data'!B149=\"\",'Corona-Covid 19 Data'!C149,'Corona-Covid 19 Data'!C149&\" \"&'Corona-Covid 19 Data'!B149)","v":"Lebanon"}]
[{"$f":"IF('Corona-Covid 19 Data'!B150=\"\",'Corona-Covid 19 Data'!C150,'Corona-Covid 19 Data'!C150&\" \"&'Corona-Covid 19 Data'!B150)","v":"Liberia"}]
[{"$f":"IF('Corona-Covid 19 Data'!B151=\"\",'Corona-Covid 19 Data'!C151,'Corona-Covid 19 Data'!C151&\" \"&'Corona-Covid 19 Data'!B151)","v":"Liechtenstein"}]
[{"$f":"IF('Corona-Covid 19 Data'!B152=\"\",'Corona-Covid 19 Data'!C152,'Corona-Covid 19 Data'!C152&\" \"&'Corona-Covid 19 Data'!B152)","v":"Lithuania"}]
[{"$f":"IF('Corona-Covid 19 Data'!B153=\"\",'Corona-Covid 19 Data'!C153,'Corona-Covid 19 Data'!C153&\" \"&'Corona-Covid 19 Data'!B153)","v":"Luxembourg"}]
[{"$f":"IF('Corona-Covid 19 Data'!B154=\"\",'Corona-Covid 19 Data'!C154,'Corona-Covid 19 Data'!C154&\" \"&'Corona-Covid 19 Data'!B154)","v":"Madagascar"}]
[{"$f":"IF('Corona-Covid 19 Data'!B155=\"\",'Corona-Covid 19 Data'!C155,'Corona-Covid 19 Data'!C155&\" \"&'Corona-Covid 19 Data'!B155)","v":"Malaysia"}]
[{"$f":"IF('Corona-Covid 19 Data'!B156=\"\",'Corona-Covid 19 Data'!C156,'Corona-Covid 19 Data'!C156&\" \"&'Corona-Covid 19 Data'!B156)","v":"Maldives"}]
[{"$f":"IF('Corona-Covid 19 Data'!B157=\"\",'Corona-Covid 19 Data'!C157,'Corona-Covid 19 Data'!C157&\" \"&'Corona-Covid 19 Data'!B157)","v":"Malta"}]
[{"$f":"IF('Corona-Covid 19 Data'!B158=\"\",'Corona-Covid 19 Data'!C158,'Corona-Covid 19 Data'!C158&\" \"&'Corona-Covid 19 Data'!B158)","v":"Mauritania"}]
[{"$f":"IF('Corona-Covid 19 Data'!B159=\"\",'Corona-Covid 19 Data'!C159,'Corona-Covid 19 Data'!C159&\" \"&'Corona-Covid 19 Data'!B159)","v":"Mauritius"}]
[{"$f":"IF('Corona-Covid 19 Data'!B160=\"\",'Corona-Covid 19 Data'!C160,'Corona-Covid 19 Data'!C160&\" \"&'Corona-Covid 19 Data'!B160)","v":"Mexico"}]
[{"$f":"IF('Corona-Covid 19 Data'!B161=\"\",'Corona-Covid 19 Data'!C161,'Corona-Covid 19 Data'!C161&\" \"&'Corona-Covid 19 Data'!B161)","v":"Moldova"}]
[{"$f":"IF('Corona-Covid 19 Data'!B162=\"\",'Corona-Covid 19 Data'!C162,'Corona-Covid 19 Data'!C162&\" \"&'Corona-Covid 19 Data'!B162)","v":"Monaco"}]
[{"$f":"IF('Corona-Covid 19 Data'!B163=\"\",'Corona-Covid 19 Data'!C163,'Corona-Covid 19 Data'!C163&\" \"&'Corona-Covid 19 Data'!B163)","v":"Mongolia"}]
[{"$f":"IF('Corona-Covid 19 Data'!B164=\"\",'Corona-Covid 19 Data'!C164,'Corona-Covid 19 Data'!C164&\" \"&'Corona-Covid 19 Data'!B164)","v":"Montenegro"}]
[{"$f":"IF('Corona-Covid 19 Data'!B165=\"\",'Corona-Covid 19 Data'!C165,'Corona-Covid 19 Data'!C165&\" \"&'Corona-Covid 19 Data'!B165)","v":"Morocco"}]
[{"$f":"IF('Corona-Covid 19 Data'!B166=\"\",'Corona-Covid 19 Data'!C166,'Corona-Covid 19 Data'!C166&\" \"&'Corona-Covid 19 Data'!B166)","v":"Namibia"}]
[{"$f":"IF('Corona-Covid 19 Data'!B167=\"\",'Corona-Covid 19 Data'!C167,'Corona-Covid 19 Data'!C167&\" \"&'Corona-Covid 19 Data'!B167)","v":"Nepal"}]
[{"$f":"IF('Corona-Covid 19 Data'!B168=\"\",'Corona-Covid 19 Data'!C168,'Corona-Covid 19 Data'!C168&\" \"&'Corona-Covid 19 Data'!B168)","v":"Netherlands Aruba"}]
[{"$f":"IF('Corona-Covid 19 Data'!B169=\"\",'Corona-Covid 19 Data'!C169,'Corona-Covid 19 Data'!C169&\" \"&'Corona-Covid 19 Data'!B169)","v":"Netherlands Curacao"}]
[{"$f":"IF('Corona-Covid 19 Data'!B170=\"\",'Corona-Covid 19 Data'!C170,'Corona-Covid 19 Data'!C170&\" \"&'Corona-Covid 19 Data'!B170)","v":"Netherlands Sint Maarten"}]
[{"$f":"IF('Corona-Covid 19 Data'!B171=\"\",'Corona-Covid 19 Data'!C171,'Corona-Covid 19 Data'!C171&\" \"&'Corona-Covid 19 Data'!B171)","v":"Netherlands"}]
[{"$f":"IF('Corona-Covid 19 Data'!B172=\"\",'Corona-Covid 19 Data'!C172,'Corona-Covid 19 Data'!C172&\" \"&'Corona-Covid 19 Data'!B172)","v":"New Zealand"}]
[{"$f":"IF('Corona-Covid 19 Data'!B173=\"\",'Corona-Covid 19 Data'!C173,'Corona-Covid 19 Data'!C173&\" \"&'Corona-Covid 19 Data'!B173)","v":"Nicaragua"}]
[{"$f":"IF('Corona-Covid 19 Data'!B174=\"\",'Corona-Covid 19 Data'!C174,'Corona-Covid 19 Data'!C174&\" \"&'Corona-Covid 19 Data'!B174)","v":"Niger"}]
[{"$f":"IF('Corona-Covid 19 Data'!B175=\"\",'Corona-Covid 19 Data'!C175,'Corona-Covid 19 Data'!C175&\" \"&'Corona-Covid 19 Data'!B175)","v":"Nigeria"}]
[{"$f":"IF('Corona-Covid 19 Data'!B176=\"\",'Corona-Covid 19 Data'!C176,'Corona-Covid 19 Data'!C176&\" \"&'Corona-Covid 19 Data'!B176)","v":"North Macedonia"}]
[{"$f":"IF('Corona-Covid 19 Data'!B177=\"\",'Corona-Covid 19 Data'!C177,'Corona-Covid 19 Data'!C177&\" \"&'Corona-Covid 19 Data'!B177)","v":"Norway"}]
[{"$f":"IF('Corona-Covid 19 Data'!B178=\"\",'Corona-Covid 19 Data'!C178,'Corona-Covid 19 Data'!C178&\" \"&'Corona-Covid 19 Data'!B178)","v":"Oman"}]
[{"$f":"IF('Corona-Covid 19 Data'!B179=\"\",'Corona-Covid 19 Data'!C179,'Corona-Covid 19 Data'!C179&\" \"&'Corona-Covid 19 Data'!B179)","v":"Pakistan"}]
[{"$f":"IF('Corona-Covid 19 Data'!B180=\"\",'Corona-Covid 19 Data'!C180,'Corona-Covid 19 Data'!C180&\" \"&'Corona-Covid 19 Data'!B180)","v":"Panama"}]
[{"$f":"IF('Corona-Covid 19 Data'!B181=\"\",'Corona-Covid 19 Data'!C181,'Corona-Covid 19 Data'!C181&\" \"&'Corona-Covid 19 Data'!B181)","v":"Papua New Guinea"}]
[{"$f":"IF('Corona-Covid 19 Data'!B182=\"\",'Corona-Covid 19 Data'!C182,'Corona-Covid 19 Data'!C182&\" \"&'Corona-Covid 19 Data'!B182)","v":"Paraguay"}]
[{"$f":"IF('Corona-Covid 19 Data'!B183=\"\",'Corona-Covid 19 Data'!C183,'Corona-Covid 19 Data'!C183&\" \"&'Corona-Covid 19 Data'!B183)","v":"Peru"}]
[{"$f":"IF('Corona-Covid 19 Data'!B184=\"\",'Corona-Covid 19 Data'!C184,'Corona-Covid 19 Data'!C184&\" \"&'Corona-Covid 19 Data'!B184)","v":"Philippines"}]
[{"$f":"IF('Corona-Covid 19 Data'!B185=\"\",'Corona-Covid 19 Data'!C185,'Corona-Covid 19 Data'!C185&\" \"&'Corona-Covid 19 Data'!B185)","v":"Poland"}]
[{"$f":"IF('Corona-Covid 19 Data'!B186=\"\",'Corona-Covid 19 Data'!C186,'Corona-Covid 19 Data'!C186&\" \"&'Corona-Covid 19 Data'!B186)","v":"Portugal"}]
[{"$f":"IF('Corona-Covid 19 Data'!B187=\"\",'Corona-Covid 19 Data'!C187,'Corona-Covid 19 Data'!C187&\" \"&'Corona-Covid 19 Data'!B187)","v":"Qatar"}]
[{"$f":"IF('Corona-Covid 19 Data'!B188=\"\",'Corona-Covid 19 Data'!C188,'Corona-Covid 19 Data'!C188&\" \"&'Corona-Covid 19 Data'!B188)","v":"Romania"}]
[{"$f":"IF('Corona-Covid 19 Data'!B189=\"\",'Corona-Covid 19 Data'!C189,'Corona-Covid 19 Data'!C189&\" \"&'Corona-Covid 19 Data'!B189)","v":"Russia"}]
[{"$f":"IF('Corona-Covid 19 Data'!B190=\"\",'Corona-Covid 19 Data'!C190,'Corona-Covid 19 Data'!C190&\" \"&'Corona-Covid 19 Data'!B190)","v":"Rwanda"}]
[{"$f":"IF('Corona-Covid 19 Data'!B191=\"\",'Corona-Covid 19 Data'!C191,'Corona-Covid 19 Data'!C191&\" \"&'Corona-Covid 19 Data'!B191)","v":"Saint Lucia"}]
[{"$f":"IF('Corona-Covid 19 Data'!B192=\"\",'Corona-Covid 19 Data'!C192,'Corona-Covid 19 Data'!C192&\" \"&'Corona-Covid 19 Data'!B192)","v":"Saint Vincent and the Grenadines"}]
[{"$f":"IF('Corona-Covid 19 Data'!B193=\"\",'Corona-Covid 19 Data'!C193,'Corona-Covid 19 Data'!C193&\" \"&'Corona-Covid 19 Data'!B193)","v":"San Marino"}]
[{"$f":"IF('Corona-Covid 19 Data'!B194=\"\",'Corona-Covid 19 Data'!C194,'Corona-Covid 19 Data'!C194&\" \"&'Corona-Covid 19 Data'!B194)","v":"Saudi Arabia"}]
[{"$f":"IF('Corona-Covid 19 Data'!B195=\"\",'Corona-Covid 19 Data'!C195,'Corona-Covid 19 Data'!C195&\" \"&'Corona-Covid 19 Data'!B195)","v":"Senegal"}]
[{"$f":"IF('Corona-Covid 19 Data'!B196=\"\",'Corona-Covid 19 Data'!C196,'Corona-Covid 19 Data'!C196&\" \"&'Corona-Covid 19 Data'!B196)","v":"Serbia"}]
[{"$f":"IF('Corona-Covid 19 Data'!B197=\"\",'Corona-Covid 19 Data'!C197,'Corona-Covid 19 Data'!C197&\" \"&'Corona-Covid 19 Data'!B197)","v":"Seychelles"}]
[{"$f":"IF('Corona-Covid 19 Data'!B198=\"\",'Corona-Covid 19 Data'!C198,'Corona-Covid 19 Data'!C198&\" \"&'Corona-Covid 19 Data'!B198)","v":"Singapore"}]
[{"$f":"IF('Corona-Covid 19 Data'!B199=\"\",'Corona-Covid 19 Data'!C199,'Corona-Covid 19 Data'!C199&\" \"&'Corona-Covid 19 Data'!B199)","v":"Slovakia"}]
[{"$f":"IF('Corona-Covid 19 Data'!B200=\"\",'Corona-Covid 19 Data'!C200,'Corona-Covid 19 Data'!C200&\" \"&'Corona-Covid 19 Data'!B200)","v":"Slovenia"}]
[{"$f":"IF('Corona-Covid 19 Data'!B201=\"\",'Corona-Covid 19 Data'!C201,'Corona-Covid 19 Data'!C201&\" \"&'Corona-Covid 19 Data'!B201)","v":"Somalia"}]
[{"$f":"IF('Corona-Covid 19 Data'!B202=\"\",'Corona-Covid 19 Data'!C202,'Corona-Covid 19 Data'!C202&\" \"&'Corona-Covid 19 Data'!B202)","v":"South Africa"}]
[{"$f":"IF('Corona-Covid 19 Data'!B203=\"\",'Corona-Covid 19 Data'!C203,'Corona-Covid 19 Data'!C203&\" \"&'Corona-Covid 19 Data'!B203)","v":"Spain"}]
[{"$f":"IF('Corona-Covid 19 Data'!B204=\"\",'Corona-Covid 19 Data'!C204,'Corona-Covid 19 Data'!C204&\" \"&'Corona-Covid 19 Data'!B204)","v":"Sri Lanka"}]
[{"$f":"IF('Corona-Covid 19 Data'!B205=\"\",'Corona-Covid 19 Data'!C205,'Corona-Covid 19 Data'!C205&\" \"&'Corona-Covid 19 Data'!B205)","v":"Sudan"}]
[{"$f":"IF('Corona-Covid 19 Data'!B206=\"\",'Corona-Covid 19 Data'!C206,'Corona-Covid 19 Data'!C206&\" \"&'Corona-Covid 19 Data'!B206)","v":"Suriname"}]
[{"$f":"IF('Corona-Covid 19 Data'!B207=\"\",'Corona-Covid 19 Data'!C207,'Corona-Covid 19 Data'!C207&\" \"&'Corona-Covid 19 Data'!B207)","v":"Sweden"}]
[{"$f":"IF('Corona-Covid 19 Data'!B208=\"\",'Corona-Covid 19 Data'!C208,'Corona-Covid 19 Data'!C208&\" \"&'Corona-Covid 19 Data'!B208)","v":"Switzerland"}]
[{"$f":"IF('Corona-Covid 19 Data'!B209=\"\",'Corona-Covid 19 Data'!C209,'Corona-Covid 19 Data'!C209&\" \"&'Corona-Covid 19 Data'!B209)","v":"Taiwan*"}]
[{"$f":"IF('Corona-Covid 19 Data'!B210=\"\",'Corona-Covid 19 Data'!C210,'Corona-Covid 19 Data'!C210&\" \"&'Corona-Covid 19 Data'!B210)","v":"Tanzania"}]
[{"$f":"IF('Corona-Covid 19 Data'!B211=\"\",'Corona-Covid 19 Data'!C211,'Corona-Covid 19 Data'!C211&\" \"&'Corona-Covid 19 Data'!B211)","v":"Thailand"}]
[{"$f":"IF('Corona-Covid 19 Data'!B212=\"\",'Corona-Covid 19 Data'!C212,'Corona-Covid 19 Data'!C212&\" \"&'Corona-Covid 19 Data'!B212)","v":"Togo"}]
[{"$f":"IF('Corona-Covid 19 Data'!B213=\"\",'Corona-Covid 19 Data'!C213,'Corona-Covid 19 Data'!C213&\" \"&'Corona-Covid 19 Data'!B213)","v":"Trinidad and Tobago"}]
[{"$f":"IF('Corona-Covid 19 Data'!B214=\"\",'Corona-Covid 19 Data'!C214,'Corona-Covid 19 Data'!C214&\" \"&'Corona-Covid 19 Data'!B214)","v":"Tunisia"}]
[{"$f":"IF('Corona-Covid 19 Data'!B215=\"\",'Corona-Covid 19 Data'!C215,'Corona-Covid 19 Data'!C215&\" \"&'Corona-Covid 19 Data'!B215)","v":"Turkey"}]
[{"$f":"IF('Corona-Covid 19 Data'!B216=\"\",'Corona-Covid 19 Data'!C216,'Corona-Covid 19 Data'!C216&\" \"&'Corona-Covid 19 Data'!B216)","v":"Uganda"}]
[{"$f":"IF('Corona-Covid 19 Data'!B217=\"\",'Corona-Covid 19 Data'!C217,'Corona-Covid 19 Data'!C217&\" \"&'Corona-Covid 19 Data'!B217)","v":"Ukraine"}]
[{"$f":"IF('Corona-Covid 19 Data'!B218=\"\",'Corona-Covid 19 Data'!C218,'Corona-Covid 19 Data'!C218&\" \"&'Corona-Covid 19 Data'!B218)","v":"United Arab Emirates"}]
[{"$f":"IF('Corona-Covid 19 Data'!B219=\"\",'Corona-Covid 19 Data'!C219,'Corona-Covid 19 Data'!C219&\" \"&'Corona-Covid 19 Data'!B219)","v":"United Kingdom Bermuda"}]
[{"$f":"IF('Corona-Covid 19 Data'!B220=\"\",'Corona-Covid 19 Data'!C220,'Corona-Covid 19 Data'!C220&\" \"&'Corona-Covid 19 Data'!B220)","v":"United Kingdom Cayman Islands"}]
[{"$f":"IF('Corona-Covid 19 Data'!B221=\"\",'Corona-Covid 19 Data'!C221,'Corona-Covid 19 Data'!C221&\" \"&'Corona-Covid 19 Data'!B221)","v":"United Kingdom Channel Islands"}]
[{"$f":"IF('Corona-Covid 19 Data'!B222=\"\",'Corona-Covid 19 Data'!C222,'Corona-Covid 19 Data'!C222&\" \"&'Corona-Covid 19 Data'!B222)","v":"United Kingdom Gibraltar"}]
[{"$f":"IF('Corona-Covid 19 Data'!B223=\"\",'Corona-Covid 19 Data'!C223,'Corona-Covid 19 Data'!C223&\" \"&'Corona-Covid 19 Data'!B223)","v":"United Kingdom Isle of Man"}]
[{"$f":"IF('Corona-Covid 19 Data'!B224=\"\",'Corona-Covid 19 Data'!C224,'Corona-Covid 19 Data'!C224&\" \"&'Corona-Covid 19 Data'!B224)","v":"United Kingdom Montserrat"}]
[{"$f":"IF('Corona-Covid 19 Data'!B225=\"\",'Corona-Covid 19 Data'!C225,'Corona-Covid 19 Data'!C225&\" \"&'Corona-Covid 19 Data'!B225)","v":"United Kingdom"}]
[{"$f":"IF('Corona-Covid 19 Data'!B226=\"\",'Corona-Covid 19 Data'!C226,'Corona-Covid 19 Data'!C226&\" \"&'Corona-Covid 19 Data'!B226)","v":"Uruguay"}]
[{"$f":"IF('Corona-Covid 19 Data'!B227=\"\",'Corona-Covid 19 Data'!C227,'Corona-Covid 19 Data'!C227&\" \"&'Corona-Covid 19 Data'!B227)","v":"US"}]
[{"$f":"IF('Corona-Covid 19 Data'!B228=\"\",'Corona-Covid 19 Data'!C228,'Corona-Covid 19 Data'!C228&\" \"&'Corona-Covid 19 Data'!B228)","v":"Uzbekistan"}]
[{"$f":"IF('Corona-Covid 19 Data'!B229=\"\",'Corona-Covid 19 Data'!C229,'Corona-Covid 19 Data'!C229&\" \"&'Corona-Covid 19 Data'!B229)","v":"Venezuela"}]
[{"$f":"IF('Corona-Covid 19 Data'!B230=\"\",'Corona-Covid 19 Data'!C230,'Corona-Covid 19 Data'!C230&\" \"&'Corona-Covid 19 Data'!B230)","v":"Vietnam"}]
[{"$f":"IF('Corona-Covid 19 Data'!B231=\"\",'Corona-Covid 19 Data'!C231,'Corona-Covid 19 Data'!C231&\" \"&'Corona-Covid 19 Data'!B231)","v":"Zambia"}]
[{"$f":"IF('Corona-Covid 19 Data'!B232=\"\",'Corona-Covid 19 Data'!C232,'Corona-Covid 19 Data'!C232&\" \"&'Corona-Covid 19 Data'!B232)","v":"Zimbabwe"}]
[{"$f":"IF('Corona-Covid 19 Data'!B233=\"\",'Corona-Covid 19 Data'!C233,'Corona-Covid 19 Data'!C233&\" \"&'Corona-Covid 19 Data'!B233)","v":"Canada Diamond Princess"}]
[{"$f":"IF('Corona-Covid 19 Data'!B234=\"\",'Corona-Covid 19 Data'!C234,'Corona-Covid 19 Data'!C234&\" \"&'Corona-Covid 19 Data'!B234)","v":"Dominica"}]
[{"$f":"IF('Corona-Covid 19 Data'!B235=\"\",'Corona-Covid 19 Data'!C235,'Corona-Covid 19 Data'!C235&\" \"&'Corona-Covid 19 Data'!B235)","v":"Grenada"}]
[{"$f":"IF('Corona-Covid 19 Data'!B236=\"\",'Corona-Covid 19 Data'!C236,'Corona-Covid 19 Data'!C236&\" \"&'Corona-Covid 19 Data'!B236)","v":"Mozambique"}]
[{"$f":"IF('Corona-Covid 19 Data'!B237=\"\",'Corona-Covid 19 Data'!C237,'Corona-Covid 19 Data'!C237&\" \"&'Corona-Covid 19 Data'!B237)","v":"Syria"}]
[{"$f":"IF('Corona-Covid 19 Data'!B238=\"\",'Corona-Covid 19 Data'!C238,'Corona-Covid 19 Data'!C238&\" \"&'Corona-Covid 19 Data'!B238)","v":"Timor-Leste"}]
[{"$f":"IF('Corona-Covid 19 Data'!B239=\"\",'Corona-Covid 19 Data'!C239,'Corona-Covid 19 Data'!C239&\" \"&'Corona-Covid 19 Data'!B239)","v":"Belize"}]
[{"$f":"IF('Corona-Covid 19 Data'!B240=\"\",'Corona-Covid 19 Data'!C240,'Corona-Covid 19 Data'!C240&\" \"&'Corona-Covid 19 Data'!B240)","v":"Laos"}]
[{"$f":"IF('Corona-Covid 19 Data'!B241=\"\",'Corona-Covid 19 Data'!C241,'Corona-Covid 19 Data'!C241&\" \"&'Corona-Covid 19 Data'!B241)","v":"Libya"}]
[{"$f":"IF('Corona-Covid 19 Data'!B242=\"\",'Corona-Covid 19 Data'!C242,'Corona-Covid 19 Data'!C242&\" \"&'Corona-Covid 19 Data'!B242)","v":"West Bank and Gaza"}]
[{"$f":"IF('Corona-Covid 19 Data'!B243=\"\",'Corona-Covid 19 Data'!C243,'Corona-Covid 19 Data'!C243&\" \"&'Corona-Covid 19 Data'!B243)","v":"Guinea-Bissau"}]
[{"$f":"IF('Corona-Covid 19 Data'!B244=\"\",'Corona-Covid 19 Data'!C244,'Corona-Covid 19 Data'!C244&\" \"&'Corona-Covid 19 Data'!B244)","v":"Mali"}]
[{"$f":"IF('Corona-Covid 19 Data'!B245=\"\",'Corona-Covid 19 Data'!C245,'Corona-Covid 19 Data'!C245&\" \"&'Corona-Covid 19 Data'!B245)","v":"Saint Kitts and Nevis"}]
[{"$f":"IF('Corona-Covid 19 Data'!B246=\"\",'Corona-Covid 19 Data'!C246,'Corona-Covid 19 Data'!C246&\" \"&'Corona-Covid 19 Data'!B246)","v":"Canada Northwest Territories"}]
[{"$f":"IF('Corona-Covid 19 Data'!B247=\"\",'Corona-Covid 19 Data'!C247,'Corona-Covid 19 Data'!C247&\" \"&'Corona-Covid 19 Data'!B247)","v":"Canada Yukon"}]
[{"$f":"IF('Corona-Covid 19 Data'!B248=\"\",'Corona-Covid 19 Data'!C248,'Corona-Covid 19 Data'!C248&\" \"&'Corona-Covid 19 Data'!B248)","v":"Kosovo"}]
[{"$f":"IF('Corona-Covid 19 Data'!B249=\"\",'Corona-Covid 19 Data'!C249,'Corona-Covid 19 Data'!C249&\" \"&'Corona-Covid 19 Data'!B249)","v":"Burma"}]
[{"$f":"IF('Corona-Covid 19 Data'!B250=\"\",'Corona-Covid 19 Data'!C250,'Corona-Covid 19 Data'!C250&\" \"&'Corona-Covid 19 Data'!B250)","v":"United Kingdom Anguilla"}]
[{"$f":"IF('Corona-Covid 19 Data'!B251=\"\",'Corona-Covid 19 Data'!C251,'Corona-Covid 19 Data'!C251&\" \"&'Corona-Covid 19 Data'!B251)","v":"United Kingdom British Virgin Islands"}]
[{"$f":"IF('Corona-Covid 19 Data'!B252=\"\",'Corona-Covid 19 Data'!C252,'Corona-Covid 19 Data'!C252&\" \"&'Corona-Covid 19 Data'!B252)","v":"United Kingdom Turks and Caicos Islands"}]
[{"$f":"IF('Corona-Covid 19 Data'!B253=\"\",'Corona-Covid 19 Data'!C253,'Corona-Covid 19 Data'!C253&\" \"&'Corona-Covid 19 Data'!B253)","v":"MS Zaandam"}]
[{"$f":"IF('Corona-Covid 19 Data'!B254=\"\",'Corona-Covid 19 Data'!C254,'Corona-Covid 19 Data'!C254&\" \"&'Corona-Covid 19 Data'!B254)","v":"Botswana"}]
[{"$f":"IF('Corona-Covid 19 Data'!B255=\"\",'Corona-Covid 19 Data'!C255,'Corona-Covid 19 Data'!C255&\" \"&'Corona-Covid 19 Data'!B255)","v":"Burundi"}]
[{"$f":"IF('Corona-Covid 19 Data'!B256=\"\",'Corona-Covid 19 Data'!C256,'Corona-Covid 19 Data'!C256&\" \"&'Corona-Covid 19 Data'!B256)","v":"Sierra Leone"}]
[{"$f":"IF('Corona-Covid 19 Data'!B257=\"\",'Corona-Covid 19 Data'!C257,'Corona-Covid 19 Data'!C257&\" \"&'Corona-Covid 19 Data'!B257)","v":"Netherlands Bonaire, Sint Eustatius and Saba"}]
[{"$f":"IF('Corona-Covid 19 Data'!B258=\"\",'Corona-Covid 19 Data'!C258,'Corona-Covid 19 Data'!C258&\" \"&'Corona-Covid 19 Data'!B258)","v":"Malawi"}]
[{"$f":"IF('Corona-Covid 19 Data'!B259=\"\",'Corona-Covid 19 Data'!C259,'Corona-Covid 19 Data'!C259&\" \"&'Corona-Covid 19 Data'!B259)","v":"United Kingdom Falkland Islands (Malvinas)"}]
[{"$f":"IF('Corona-Covid 19 Data'!B260=\"\",'Corona-Covid 19 Data'!C260,'Corona-Covid 19 Data'!C260&\" \"&'Corona-Covid 19 Data'!B260)","v":"France Saint Pierre and Miquelon"}]
[{"$f":"IF('Corona-Covid 19 Data'!B261=\"\",'Corona-Covid 19 Data'!C261,'Corona-Covid 19 Data'!C261&\" \"&'Corona-Covid 19 Data'!B261)","v":"South Sudan"}]
[{"$f":"IF('Corona-Covid 19 Data'!B262=\"\",'Corona-Covid 19 Data'!C262,'Corona-Covid 19 Data'!C262&\" \"&'Corona-Covid 19 Data'!B262)","v":"Western Sahara"}]
[{"$f":"IF('Corona-Covid 19 Data'!B263=\"\",'Corona-Covid 19 Data'!C263,'Corona-Covid 19 Data'!C263&\" \"&'Corona-Covid 19 Data'!B263)","v":"Sao Tome and Principe"}]
[{"$f":"IF('Corona-Covid 19 Data'!B264=\"\",'Corona-Covid 19 Data'!C264,'Corona-Covid 19 Data'!C264&\" \"&'Corona-Covid 19 Data'!B264)","v":"Yemen"}]